{"text_format":"1","workbook":"xlsx","n_sheets":20,"sheets":["Broker","PEL","1 - Main","Drop down","2 - Income","3 - Debt","4 - Expenditure","5 - Notes"," VBS Criteria","Guidance Notes","ONS Update","ONS Explanation Table","ONS 2024","ONS 2022","ONS 2021","ONS 2016","ONS 2018","ONS expenditure breakdown A1","Version control","Admin"],"not_rendered":{"charts":114,"images":2,"macros":1,"external_links":0,"defined_names":16,"comments":0,"pivot_tables":0},"unopened":[],"bounds":{"document_bytes":16777216,"sheet_cells":100000,"rows_first":2000,"rows_last":500,"rows_between":2000,"halvings":0,"cell_chars":16384,"cell_head_chars":4096},"cells_cut":0,"cells_raw":0,"read":"whole","date_system":"1900"}

{"sheet":"Broker","index":0,"n_rows":106,"n_cols":13,"rows_kept":106,"cut":false,"hidden":false,"merged":[[82,1,82,3],[81,1,81,3],[80,1,80,3],[73,1,73,3],[72,1,72,3],[74,1,74,3],[75,1,75,3],[76,1,76,3],[77,1,77,3],[79,1,79,3],[77,4,77,11],[79,4,79,11],[80,4,80,11],[81,4,81,11],[82,4,82,11],[72,4,72,11],[73,4,73,11],[74,4,74,11],[75,4,75,11],[76,4,76,11],[88,4,88,11],[84,1,84,3],[86,1,86,3],[83,4,83,11],[87,1,87,3],[88,1,88,3],[84,4,84,11],[86,4,86,11],[87,4,87,11],[69,1,69,11],[42,1,42,11],[6,1,6,11],[58,1,58,11],[14,1,14,11],[26,1,26,11],[16,1,16,3],[18,1,18,3],[22,1,22,3],[24,1,24,3],[24,7,24,9],[13,3,13,7],[30,1,30,3],[60,1,60,3],[62,1,62,3],[64,1,64,3],[62,9,62,11],[64,9,64,11],[66,1,66,3],[66,9,66,11],[30,7,30,9],[37,1,37,3],[37,7,37,9],[101,1,101,4],[101,5,101,6],[92,1,92,11],[97,1,97,4],[97,5,97,6],[98,1,98,4],[98,5,98,6],[99,1,99,4],[99,5,99,6],[94,1,94,4],[94,5,94,6],[95,1,95,4],[95,5,95,6],[96,1,96,4],[96,5,96,6]]}
[]
[]
[]
[]
[]
[]
[null,"Residential Affordability Assessment"]
[]
{"$rows_left_out":99}
{"sheet":"PEL","index":1,"n_rows":32,"n_cols":5,"rows_kept":32,"cut":false,"hidden":true,"merged":[[12,0,12,1],[8,3,8,6],[9,3,9,6],[4,3,4,6],[7,3,7,6],[5,3,6,6]]}
["PEL"]
[]
["Proxy Expected Loss"]
[]
[null,"LTV","PEL"]
["BTL",null,7.0000000000000001E-3]
["Holiday BTL",null,7.0000000000000001E-3]
["Mainstream","80% to 90%",0.01]
{"$rows_left_out":25}
{"sheet":"1 - Main","index":2,"n_rows":100,"n_cols":19,"rows_kept":100,"cut":false,"hidden":true,"merged":[[54,11,54,12],[55,7,55,10],[57,7,57,10],[57,11,57,12],[52,11,52,12],[55,11,55,12],[50,11,50,12],[51,7,51,10],[51,11,51,12],[52,7,52,10],[53,11,53,12],[53,7,53,10],[28,2,28,3],[30,2,30,3],[31,2,31,3],[44,2,44,3],[32,2,32,3],[43,2,43,3],[34,2,34,3],[35,2,35,3],[0,11,0,13],[1,2,1,3],[1,5,1,8],[3,2,3,3],[3,5,3,8],[0,5,0,9],[5,2,5,3],[5,5,5,8],[7,2,7,3],[7,5,7,8],[23,2,23,3],[13,2,13,3],[21,2,21,3],[15,2,15,3],[11,2,11,3],[17,2,17,3],[19,2,19,3],[9,2,9,3],[13,7,13,9],[87,2,87,3],[87,5,87,6],[13,10,13,11],[36,2,36,3],[37,2,37,3],[38,2,38,3],[40,2,40,3],[41,2,41,3],[39,2,39,3],[26,2,26,3],[42,2,42,3],[45,2,45,3],[65,2,65,5],[50,7,50,10],[54,7,54,10],[48,3,48,17],[98,14,98,17],[60,11,60,12],[60,7,60,10],[13,13,13,15],[87,7,87,17],[63,2,63,17],[58,7,58,10],[58,11,58,12],[59,7,59,10],[59,11,59,12],[73,3,73,5],[67,2,67,5],[69,2,69,5],[68,2,68,5],[75,3,75,5],[76,3,76,5],[99,2,99,17],[93,2,94,2],[93,3,93,13],[93,14,94,17],[94,3,94,7],[94,8,94,11],[94,12,94,13],[95,3,95,7],[95,8,97,11],[95,12,96,13],[95,14,96,17],[96,3,96,7],[97,3,98,7],[97,12,98,13],[97,14,97,17],[98,8,98,11]]}
[null,null,null,null,null,"Residential Affordability Calculator",null,null,null,null,null,"Mortgage Affordability Calculator - 22.0 - November 2025"]
[null,null,"Borrower name(s)",null,null,null,null,null,null,null,"Prepared by:"]
[]
[null,null,"Application number",null,null,null,null,null,null,null,"Date prepared:"]
[]
[null,null,"Product Type"]
[]
[null,null,"Product Rate"]
{"$rows_left_out":93}
{"sheet":"Drop down","index":3,"n_rows":41,"n_cols":21,"rows_kept":41,"cut":false,"hidden":true,"merged":[[1,14,4,14],[0,14,0,19],[7,20,10,20],[6,14,6,19]]}
["Term of mort",null,"Type of mort",null,"Dependants","calculation","Number of applicants","Calculation","Stressed Rate","Source",null,"Decision","Mortgage Type",null,"Matrix "]
[1,null,"Capital & Interest",null,0,0,1,1,"Standard","Adviser Input",null,"Pass","Residential",null,"LTV","=90>=95",2,3,4,4]
[2,null,"Interest Only",null,1,10,"2+",2,"5-Year Fixed","Bank Statement",null,"Fail","Self-Build",null,null,"=80>90",2,3,4,4]
[3,null,"Part & Part",null,2,20,null,null,null,"Underwriter Input",null,"Marginal Pass",null,null,null,"=60>80",1,2,3,4]
[4,null,null,null,"3+",30,null,null,null,null,null,"Refer",null,null,null,"<60",1,2,3,4]
[5,null,"Source",null,null,null,null,null,null,null,null,null,null,null,null,null,"<75","75>=90","90>=95","95>=100"," % of max affordabe loan used"]
[6,null,"Broker",null,null,null,null,null,null,null,null,null,null,null,"Calculations"]
[7,null,"Direct",null,null,null,null,null,null,null,null,null,null,null,"LTV",null,null,null,null,null,"LTV"]
{"$rows_left_out":34}
{"sheet":"2 - Income","index":4,"n_rows":66,"n_cols":22,"rows_kept":66,"cut":false,"hidden":true,"merged":[[14,1,15,1],[4,1,4,2],[9,1,9,2],[12,9,13,9],[5,1,6,1],[7,1,8,1],[10,1,11,1],[12,1,13,1],[4,9,4,10],[5,9,6,9],[7,9,8,9],[9,9,9,10],[10,9,11,9],[30,1,30,6],[30,9,30,14],[18,1,18,2],[20,1,21,1],[22,1,23,1],[24,1,25,1],[44,9,45,9],[46,9,47,9],[48,9,49,9],[41,1,41,2],[42,1,43,1],[42,9,43,9],[39,1,40,1],[46,1,47,1],[48,1,49,1],[50,1,50,2],[52,1,53,1],[44,1,45,1],[3,9,3,15],[3,1,3,7],[35,1,35,7],[36,1,36,2],[37,1,38,1],[16,1,17,1],[26,1,26,2],[16,9,17,9],[26,9,26,10],[29,1,29,6],[29,9,29,14],[14,9,15,9],[18,9,18,10],[20,9,21,9],[22,9,23,9],[24,9,25,9],[35,9,35,15],[36,9,36,10],[37,9,38,9],[39,9,40,9],[41,9,41,10],[54,1,55,1],[56,1,57,1],[58,1,58,2],[61,1,61,6],[62,1,62,6],[62,9,62,14],[50,9,50,10],[52,9,53,9],[54,9,55,9],[56,9,57,9],[58,9,58,10],[61,9,61,14],[32,6,32,7],[33,6,33,7],[32,3,32,4],[33,3,33,4],[32,1,33,2],[32,9,33,10],[32,11,32,12],[32,14,32,15],[33,11,33,12],[33,14,33,15],[64,1,65,2],[64,3,64,4],[64,6,64,7],[65,3,65,4],[65,6,65,7],[64,9,65,10],[64,11,64,12],[64,14,64,15],[65,11,65,12],[65,14,65,15]]}
[null,null,null,null,null,null,null,null,null,null,null,null,null,null,null,null,null,null,1,1,null,1]
[null,"Income",null,null,null,null,null,null,null,null,null,null,null,null,null,null,null,null,0.8,0.75,null,2]
[null,null,null,null,null,null,null,null,null,null,null,null,null,null,null,null,null,null,0.5,0.5,null,3]
[null,"Applicant 1",null,null,null,null,null,null,null,"Applicant 2"]
[null,"Employed (Monthly)",null,1,2,"3 (latest)","Weighting","Amount Used",null,"Employed (Monthly)",null,{"$f":"D5","v":1},{"$f":"E5","v":2},{"$f":"F5","v":"3 (latest)"},"Weighting","Amount Used"]
[null,"Basic Pay","Gross Monthly Basic",null,null,null,1,{"$f":"IFERROR((SUM(D6:F6)/COUNTA(D6:F6))*G6,0)","v":0},null,"Basic Pay","Gross Monthly Basic",null,null,null,1,{"$f":"IFERROR((SUM(L6:N6)/COUNTA(L6:N6))*O6,0)","v":0}]
[null,null,"Net Monthly Basic",null,null,null,1,{"$f":"IFERROR((SUM(D7:F7)/COUNTA(D7:F7))*G7,0)","v":0},null,null,"Net Monthly Basic",null,null,null,1,{"$f":"IFERROR((SUM(L7:N7)/COUNTA(L7:N7))*O7,0)","v":0}]
[null,"Overtime","Gross Overtime",null,null,null,0.5,{"$f":"IFERROR((SUM(D8:F8)/COUNTA(D8:F8))*G8,0)","v":0},null,"Overtime","Gross Overtime",null,null,null,0.5,{"$f":"IFERROR((SUM(L8:N8)/COUNTA(L8:N8))*O8,0)","v":0}]
{"$rows_left_out":59}
{"sheet":"3 - Debt","index":5,"n_rows":33,"n_cols":13,"rows_kept":33,"cut":false,"hidden":true,"merged":[[31,2,31,4],[32,2,32,4],[35,2,35,4],[25,2,25,5],[2,11,2,12],[27,2,27,4],[28,2,28,4],[29,2,29,4],[30,2,30,4]]}
[null,null,"Credit Commitments"]
[]
[1,null,"App No","Company","Credit Type","Balance","Payment","To Be Used","Include","Justification",null,"Total to be included"]
[2,null,null,null,null,null,null,{"$f":"IF(E4=\"Credit Card\",F4*3%,G4)","v":0},null,null,null,"App 1",{"$f":"SUMIFS(H:H,C:C,A3,I:I,\"Yes\")","v":0}]
[3,null,null,null,null,null,null,{"$f":"IF(E5=\"Credit Card\",F5*3%,G5)","v":0},null,null,null,"App 2 ",{"$f":"SUMIFS(H:H,C:C,A4,I:I,\"Yes\")","v":0}]
[4,null,null,null,null,null,null,0,null,null,null,"App 3",{"$f":"SUMIFS(H:H,C:C,A5,I:I,\"Yes\")","v":0}]
[null,null,null,null,null,null,null,0,null,null,null,"App 4",{"$f":"SUMIFS(H:H,C:C,A6,I:I,\"Yes\")","v":0}]
[null,null,null,null,null,null,null,0]
{"$rows_left_out":26}
{"sheet":"4 - Expenditure","index":6,"n_rows":26,"n_cols":16,"rows_kept":26,"cut":false,"hidden":true,"merged":[[25,1,25,8],[0,1,0,4]]}
[null,"Expenditure\nFigures input into 'Underwriter confirmed'  column used against ONS",null,null,null,null,null,null,null,null,null,null,null,null,null,"Adviser Input (Level 1 - 2)"]
[null,null,null,null,null,null,null,null,null,null,null,null,null,null,null,"Bank Statement Verified (Level 3 - 4)"]
[null,"Items","Application input","Month 1","Month 2","Month 3","Underwriter Confirmed","Source","ONS","Final Value","Value Used","Justification",null,null,null,"Other - Stated in rationale"]
[null,"Council Tax",null,null,null,null,null,null,0,{"$f":"G4","v":0},{"$f":"IF(H4=\"\",\"\",IFERROR(IF(J4=0,\"\",IF(J4=I4,\"ONS\",H4)),\"\"))","v":""}]
[null,"Ground Rent/Service Charge",null,null,null,null,null,null,null,{"$f":"G5","v":0},{"$f":"IF(H5=\"\",\"\",IFERROR(IF(J5=0,\"\",IF(J5=I5,\"ONS\",H5)),\"\"))","v":""}]
[null,"Utility Total",null,null,null,null,null,null,{"$f":"'1 - Main'!P38","v":""},{"$f":"MAX(G6:I6)","v":0},""]
[null,"Food/Groceries",null,null,null,null,null,null,{"$f":"'1 - Main'!P39","v":0},0,""]
[null,"Essential Travel",null,null,null,null,null,null,{"$f":"'1 - Main'!P40","v":""},0,""]
{"$rows_left_out":19}
{"sheet":"5 - Notes","index":7,"n_rows":18,"n_cols":14,"rows_kept":18,"cut":false,"hidden":true,"merged":[[0,0,0,6]]}
["BTL in Background"]
[]
[null,"Total Mortgage Debt £","Stressed interest rate","Total Annual Rental Income","Stressed Mortgage payment (D)","Surplus (shortfall) C-D","ICR"]
["1. Single Residential Units (personal basic rate tax payer or Ltd Co)",null,null,null,{"$f":"ROUND(+B4*C4,0)","v":0},{"$f":"D4-E4","v":0},{"$f":"IFERROR(D4/E4,\"\")","v":""},null,"1. Stressed payment total",{"$f":"E4","v":0},"2. Stressed payment total",{"$f":"E5","v":0},"3. Stressed payment total",{"$f":"E6","v":0}]
["2. Single Residential Units (personal higher rate tax payer)",null,null,null,0,0,"",null,"125% of stressed payment",{"$f":"J4*1.25","v":0},"140% of stressed payment",{"$f":"L4*1.4","v":0},"145% of stressed payment",{"$f":"N4*1.45","v":0}]
["3. Holiday Let (personal basic rate tax payer or Ltd Co)",null,null,null,{"$f":"ROUND(+B6*C6,0)","v":0},{"$f":"D6-E6","v":0},{"$f":"IFERROR(D6/E6,\"\")","v":""},null,"Rent",{"$f":"D4","v":0},"Rent",{"$f":"D5","v":0},"Rent",{"$f":"D6","v":0}]
["4. Holiday Let (Higher Rate Tax payer)",null,null,null,0,null,"",null,"Surplus/Shortfall PA",{"$f":"J6-J5","v":0},"Surplus/Shortfall PA",{"$f":"L6-L5","v":0},"Surplus/Shortfall PA",{"$f":"N6-N5","v":0}]
["5. HMOs (personal basic rate tax payer or Ltd Co)",null,null,null,{"$f":"ROUND(+B8*C8,0)","v":0},{"$f":"D8-E8","v":0},{"$f":"IFERROR(D8/E8,\"\")","v":""},null,"Surplus/Shortfall PCM",{"$f":"J7/12","v":0},"Surplus/Shortfall PCM",{"$f":"L7/12","v":0},"Surplus/Shortfall PCM",{"$f":"N7/12","v":0}]
{"$rows_left_out":11}
{"sheet":" VBS Criteria","index":8,"n_rows":63,"n_cols":16,"rows_kept":63,"cut":false,"hidden":true,"merged":[[4,3,5,13],[8,14,8,15]]}
["VBS criteria set in model",null,null,null,"list","Broker"]
[null,null,null,null,null,"Direct"]
[]
["Minimum excess income required",0.05]
["Rate payable based on SVR",7.7,"%"]
["Amount stressed (additional margin applied)",1,"%"]
["Non Standard income % used ",0.5]
["Income Multiple cap for max loan amount -  standard ",4.75]
{"$rows_left_out":56}
{"sheet":"Guidance Notes","index":9,"n_rows":39,"n_cols":9,"rows_kept":39,"cut":false,"hidden":true,"merged":[[38,1,38,8],[6,1,6,2],[10,1,10,2],[10,3,10,8],[30,3,30,8],[30,1,30,2],[32,8,33,8],[15,1,15,2],[16,1,16,2],[17,1,17,2],[20,1,20,2],[21,1,21,2],[28,3,28,8],[24,3,24,8],[25,3,25,8],[16,3,16,8],[17,3,17,8],[20,3,20,8],[21,3,21,8],[22,3,22,8],[18,1,18,8],[22,1,22,2],[2,1,3,9],[4,1,4,2],[8,1,8,2],[9,1,9,2],[14,1,14,2],[13,1,13,2],[4,3,4,8],[5,3,5,8],[12,3,12,8],[7,1,7,2],[28,1,28,2],[32,1,33,1],[32,2,32,7],[33,2,33,6],[29,3,29,8],[29,1,29,2],[27,3,27,8],[19,1,19,8],[23,1,23,2],[24,1,24,2],[25,1,25,2],[26,1,26,2],[23,3,23,8],[27,1,27,2],[26,3,26,8],[15,3,15,8],[9,3,9,8],[13,3,13,8],[14,3,14,8],[6,3,6,8],[8,3,8,8],[7,3,7,8]]}
[]
[]
[null,"Once completed save a copy of the Affordability calculator in the following folder Hotel/UserData/Mortgage Affordability Calculators with the name being the application number followed by the 1st applicants surname and the second applicants surname e.g. 1234 Surname1Surname 2  - save down 1 version in excel along with the output in PDF"]
[]
[null,"Type of mortgage required",null,"Select the repayment type (initial Assessment for Standard mortgages should be on Captial & Interest irrespective of repayment type) Where this fails I/O can be used where requested as a repayment type. Note Capital & interest max LTV 95%, Interest Only 60%",null,{"$f":"IF(AND(D5=\"Interest only\",#REF!>60%),\"WARNING LOAN EXCEEDS 60% LTV\",\"\")","v":{"$error":"#REF!"}}]
[null,"Gross Basic Income",null,"For each applicant:\nEmployed / Retired - Input the annual Gross basic  income/  prior to any deductions e.g. Tax, NI, Loans, Pension contributions. \nSelf Employed (ST/ P'Ship)-  lower of:\n• Most recent years share of net profit;\n• Average share of net profit of the last 2 years.\nSelf Employed (Ltd. Co.) - the lower of:\n• Most recent years director’s remuneration plus gross dividends;\n• Average of the last 2 years director’s remuneration plus gross dividends.\nNote – Self Employed Income will not be deemed usable whereby the latest year has seen a drop of more than 25% net profit."]
[null,"Gross Additional Income",null,"Input the total annual Amount of additional income such as regular bonus, overtime, allowances etc. prior to any deductions . Where using the average of the last 3 months pay slips note this must be in line with YTD / P60. (The calculator will default to include 50%)."]
[null,"Gross Other Income",null,"Input the annual Amount of other income on top of earned / pension income such as allowable benefits/ savings / investment /unencumbered property rental income. (The calculator will default to include 50%)."]
{"$rows_left_out":32}
{"sheet":"ONS Update","index":10,"n_rows":64,"n_cols":18,"rows_kept":64,"cut":false,"hidden":true,"merged":[[26,10,26,15],[27,10,27,11],[2,11,19,14]]}
[null,null,"Single:",null,null,null,"Joint:"]
[null,"Dependants",0,1,2,3,0,1,2,3]
[null,"Monthly",{"$f":"ROUND(+C49,0)","v":1208},{"$f":"ROUND(+E49,0)","v":1342},{"$f":"ROUND(+F49,0)","v":1613},{"$f":"(J3/I3)*E3","v":1677.7554744525548},{"$f":"ROUND(+D49,0)","v":2098},{"$f":"ROUND(+G49,0)","v":2135},{"$f":"ROUND(+H49,0)","v":2192},{"$f":"ROUND(+I49,0)","v":2280},null,"Instructions for updating ONS - Note the fields requiring update on this tab are in yellow\n1 - Create new tab for A23 data table (label this Extract-ONS A23 xxxxye) and copy over latest data from website www.ons.gov.uk\n2 - Copy the monthly totals in line 46 down into line 66 as these are about to become the previous totals ( and the differenceds between the 2 are calculated once populated with the latest figures which allow you to sense check the data)\n3 - Copy and paste the data from A23 table into the yellow table (A23-I46) taking care to ensure that the data is always in thesame fields - note it may be easier to remove the values from A29-I46 of the table and copy a blank table over to the newly created Extract tab to fill it in before copying back over to this tab.\n4 - Check the movements / differences - you would expect these to be reasonably minimal - double check any large differences. \n5 - The assumptions made in the table below should be checked against the latest version of the A1 breakdown "]
[]
[null,"Code for Lookup where adult =1 and child =10",1,11,21,31,2,12,22,32]
[1,"Food & non-alcoholic drinks",{"$f":"+C53*(VLOOKUP($A6,$K$29:$M$41,3,FALSE))","v":169.43333333333334},{"$f":"+E53*(VLOOKUP($A6,$K$29:$M$41,3,FALSE))","v":205.83333333333334},{"$f":"+F53*(VLOOKUP($A6,$K$29:$M$41,3,FALSE))","v":282.09999999999997},{"$f":"+G53*(VLOOKUP($A6,$K$29:$M$41,3,FALSE))","v":350.56666666666666},{"$f":"+D53*(VLOOKUP($A6,$K$29:$M$41,3,FALSE))","v":302.03333333333336},{"$f":"+G53*(VLOOKUP($A6,$K$29:$M$41,3,FALSE))","v":350.56666666666666},396.06666666666666,461.06666666666666]
[2,"Alcoholic drinks, tobacco & narcotics",17.333333333333332,{"$f":"+E54*(VLOOKUP($A7,$K$29:$M$41,3,FALSE))","v":11.916666666666666},10.833333333333334,{"$f":"(J7/I7)*E7","v":7.8240740740740735},30.766666666666666,19.933333333333334,23.400000000000002,16.899999999999999]
[3,"Clothing & footwear",19.933333333333334,42.900000000000006,33.15,34.293103448275865,34.450000000000003,47.883333333333333,62.833333333333336,65]
{"$rows_left_out":57}
{"sheet":"ONS Explanation Table","index":11,"n_rows":15,"n_cols":7,"rows_kept":15,"cut":false,"hidden":true,"merged":[[13,3,14,3],[5,3,6,3],[5,0,6,0],[5,1,6,1],[5,2,6,2],[13,0,14,0],[13,1,14,1],[13,2,14,2]]}
["ONS Category","% to use as minimum","Essential or Basic Standard of Living ","Justification","Affordability Calculator Category","% Proportion of used","Justification"]
["Food and non-alcoholic drinks",1,"Essential","Increasing and ongoing cost","Food / Groceries",1]
["Alcoholic drink, tobacco and narcotics",0.5,"Basic","Could reduce if needed but unlikely to stop completely","Food / Groceries",1]
["Clothing and footwear",0.5,"Basic","Could reduce if needed but unlikely to stop completely","Clothing & Footwear",1]
["Housing(net), fuel and power",0.5,"Essential ","Includes rental payments in the overall figure","Home Fuel & Utility Bills",1]
["Household goods and services ",0.5,"Basic","Includes cleaning products, appliances and furniture - could reduce but unlikely to stop completely","Food / Groceries",0.5,"25% overall for cleaning products"]
[null,null,null,null,"Other",0.5,"25% for the remainder"]
["Health","No data","Essential","No data","N/A",0,"Include in Net Income Buffer"]
{"$rows_left_out":8}
{"sheet":"ONS 2024","index":12,"n_rows":68,"n_cols":22,"rows_kept":68,"cut":false,"hidden":true,"merged":[[6,13,6,14],[21,5,21,20]]}
["Table A23",null,null,null,null,null,null,null,null,null,null,null,null,"Back to Contents"]
["High level expenditure by household composition"]
["UK, financial year ending 2023"]
[]
[]
[null,null,null,null,"Retired households",null,null,null,null,null,"Non-retired",null,null,"Retired and non-retired households"]
[null,null,null,null,"State pension1",null,null,"Other retired",null,null,"One","Two",null,"One adult",null,null,"Two adults",null,null,null,"Three or more adults"]
[null,null,null,null,"One","Two ",null,"One","Two",null,"person","adults",null,"with","with",null,"with","with","with",null,"without","with"]
{"$rows_left_out":61}
{"sheet":"ONS 2022","index":13,"n_rows":69,"n_cols":62,"rows_kept":69,"cut":false,"hidden":true,"merged":[[21,5,21,20],[11,34,11,35],[6,57,6,58],[6,13,6,14],[6,28,6,29],[6,38,6,39],[6,49,6,50]]}
["Table A23",null,null,null,null,null,null,null,null,null,null,null,null,null,null,null,null,null,null,null,null,"Back to Contents"]
["Expenditure by household composition"]
["UK, financial year ending 2020"]
[]
[]
[null,null,null,null,"Retired households",null,null,null,null,null,"Non-retired",null,null,"Retired and non-retired households",null,null,null,null,null,null,null,null,null,null,null,null,"Non-retired",null,"Retired and non-retired households",null,null,null,null,null,null,2022,"Non-retired",null,"Retired and non-retired households",null,null,null,null,null,null,null,null,"Non-retired",null,"Retired and non-retired households",null,null,null,null,null,"Non-retired",null,"Retired and non-retired households"]
[null,null,null,null,"State pension1",null,null,"Other retired",null,null,"One","Two",null,"One adult",null,null,"Two adults",null,null,null,"Three or more adults",null,null,null,null,null,"One","Two","One adult",null,"Two adults",null,null,null,null,null,"One","Two","One adult",null,"Two adults",null,null,null,null,null,null,"One","Two","One adult",null,"Two adults",null,null,null,"One","Two","One adult",null,"Two adults"]
[null,null,null,null,"One","Two ",null,"One","Two",null,"person","adults",null,"with","with",null,"with","with","with",null,"without","with",null,null,null,null,"person","adults","with","with","with","with","with",null,null,null,"person","adults","with","with","with","with","with",null,null,null,null,"person","adults","with","with","with","with","with",null,"person","adults","with","with","with","with","with"]
{"$rows_left_out":62}
{"sheet":"ONS 2021","index":14,"n_rows":69,"n_cols":54,"rows_kept":69,"cut":false,"hidden":true,"merged":[[6,13,6,14],[21,5,21,20],[6,28,6,29],[6,38,6,39],[6,49,6,50]]}
["Table A23",null,null,null,null,null,null,null,null,null,null,null,null,null,null,null,null,null,null,null,null,"Back to Contents"]
["Expenditure by household composition"]
["UK, financial year ending 2020"]
[]
[]
[null,null,null,null,"Retired households",null,null,null,null,null,"Non-retired",null,null,"Retired and non-retired households",null,null,null,null,null,null,null,null,null,null,null,null,"Non-retired",null,"Retired and non-retired households",null,null,null,null,null,null,2018,"Non-retired",null,"Retired and non-retired households",null,null,null,null,null,null,null,null,"Non-retired",null,"Retired and non-retired households"]
[null,null,null,null,"State pension1",null,null,"Other retired",null,null,"One","Two",null,"One adult",null,null,"Two adults",null,null,null,"Three or more adults",null,null,null,null,null,"One","Two","One adult",null,"Two adults",null,null,null,null,null,"One","Two","One adult",null,"Two adults",null,null,null,null,null,null,"One","Two","One adult",null,"Two adults"]
[null,null,null,null,"One","Two ",null,"One","Two",null,"person","adults",null,"with","with",null,"with","with","with",null,"without","with",null,null,null,null,"person","adults","with","with","with","with","with",null,null,null,"person","adults","with","with","with","with","with",null,null,null,null,"person","adults","with","with","with","with","with"]
{"$rows_left_out":62}
{"sheet":"ONS 2016","index":15,"n_rows":69,"n_cols":18,"rows_kept":69,"cut":false,"hidden":true,"merged":[[21,6,21,16]]}
["Table A23"]
["Expenditure by household composition"]
["UK, financial year ending 2016"]
[]
[]
[null,null,null,null,null,"Retired households",null,null,null,"Non-retired",null,"Retired and non-retired households"]
[null,null,null,null,null,"State pension1",null,"Other retired",null,"One","Two","One adult",null,"Two adults",null,null,"Three or more adults"]
[null,null,null,null,null,"One","Two ","One","Two","person","adults","with","with","with","with","with","without","with"]
{"$rows_left_out":62}
{"sheet":"ONS 2018","index":16,"n_rows":55,"n_cols":27,"rows_kept":55,"cut":false,"hidden":true,"merged":[[21,6,21,16]]}
["Table A23"]
["Expenditure by household composition"]
["UK, financial year ending 2018"]
[]
[]
[null,null,null,null,null,"Retired households",null,null,null,"Non-retired",null,"Retired and non-retired households"]
[null,null,null,null,null,"State pension1",null,"Other retired",null,"One","Two","One adult",null,"Two adults",null,null,"Three or more adults",null,null,null,"One","Two","One adult",null,"Two adults"]
[null,null,null,null,null,"One","Two ","One","Two","person","adults","with","with","with","with","with","without","with",null,null,"person","adults","with","with","with","with","with"]
{"$rows_left_out":48}
{"sheet":"ONS expenditure breakdown A1","index":17,"n_rows":873,"n_cols":20,"rows_kept":873,"cut":false,"hidden":true,"merged":[[329,3,329,5],[334,3,334,5],[15,10,15,11]]}
["Table A1"]
["Components of household expenditure"]
["UK, financial year ending 2016"]
[]
[null,null,null,null,null,null,"Average weekly","Total","Recording","Percentage"]
[null,null,null,null,null,null,"expenditure","weekly","house-","standard "]
[null,null,null,null,null,null,"all house-","expenditure","holds","error (full"]
[null,null,null,null,null,null,"holds (£)","(£ million)","in sample","method)"]
{"$rows_left_out":866}
{"sheet":"Version control","index":18,"n_rows":42,"n_cols":5,"rows_kept":42,"cut":false,"hidden":true,"merged":[]}
["Affordability model - Version control"]
["Version no","Date","Changes","Actioned by","Notes / Authorised by"]
[]
[1,"26042014","Initial model"]
[2,"30062014","Amended for minor formal error in ONS calculation",null,"No risk as not used for underwriting"]
[3,"01082014","Amended to put in 4.5/4 times income caps and also ensures set to 2+ if more than one income",null,"Warning message(s) now shows"]
["2.5","08122015","ONS statistics updated to latest version"]
[null,null,"Model changed to show mortgage required rather than deposit"]
{"$rows_left_out":35}
{"sheet":"Admin","index":19,"n_rows":9,"n_cols":10,"rows_kept":9,"cut":false,"hidden":true,"merged":[]}
["UW","General1","General2","Approval Level","Affordability Level","Approver","Repayment Type","Deposit","Repayment Type","Loan Purpose"]
["Karen","Yes","Yes","Level 1","Level 1","N/A - by Underwriter","Capital & Interest","Equity in property","Capital & Repayment","Purchase"]
["Claire","No","No","Level 2","Level 2","Barrie","Interest-only","Savings","Interest-Only","Like for like Remo"]
["Louise",null,"N/A","Level 3","Level 3","Ian","Part & Part","HTB ISA","Part & Part","Remo + Cap raising"]
["Dan",null,null,"2 x Level 3","Level 4","Steve",null,"Gifted Deposit",null,"Porting"]
["Barrie",null,null,"Creditco",null,"Barrie/Ian",null,"Combination (see notes)",null,"Porting + F/A"]
[null,null,null,null,null,"Barrie/Steve",null,"Other (see notes)",null,"Further Advance"]
[null,null,null,null,null,"Ian/Steve"]
{"$rows_left_out":1}