{"text_format":"1","workbook":"xlsx","n_sheets":20,"sheets":["Broker","PEL","1 - Main","Drop down","Council Tax Bands UK","2 - Income","3 - Debt","4 - Expenditure","5 - Notes"," VBS Criteria","Guidance Notes","ONS Update","ONS 2024","ONS 2022","ONS 2021","ONS 2016","ONS 2018","ONS expenditure breakdown A1","Version control","Admin"],"not_rendered":{"charts":114,"images":2,"macros":1,"external_links":0,"defined_names":13,"comments":0,"pivot_tables":0},"unopened":[],"bounds":{"document_bytes":16777216,"sheet_cells":100000,"rows_first":2000,"rows_last":500,"rows_between":2000,"halvings":0,"cell_chars":16384,"cell_head_chars":4096},"cells_cut":0,"cells_raw":0,"read":"whole","date_system":"1900"}

{"sheet":"Broker","index":0,"n_rows":107,"n_cols":13,"rows_kept":107,"cut":false,"hidden":false,"merged":[[88,1,88,3],[89,1,89,3],[74,4,74,11],[75,4,75,11],[76,4,76,11],[77,4,77,11],[78,4,78,11],[79,4,79,11],[81,4,81,11],[82,4,82,11],[83,4,83,11],[84,4,84,11],[85,4,85,11],[87,4,87,11],[88,4,88,11],[89,4,89,11],[82,1,82,3],[83,1,83,3],[84,1,84,3],[85,1,85,3],[87,1,87,3],[76,1,76,3],[77,1,77,3],[78,1,78,3],[79,1,79,3],[81,1,81,3],[71,1,71,11],[74,1,74,3],[75,1,75,3],[42,1,42,11],[6,1,6,11],[56,1,56,11],[14,1,14,11],[26,1,26,11],[16,1,16,3],[18,1,18,3],[22,1,22,3],[24,1,24,3],[24,7,24,9],[13,3,13,7],[68,5,69,7],[68,1,69,3],[30,1,30,3],[58,1,58,3],[66,1,66,11],[67,5,67,6],[68,9,69,11],[60,1,60,3],[62,1,62,3],[60,9,60,11],[62,9,62,11],[64,1,64,3],[64,9,64,11],[30,7,30,9],[37,1,37,3],[37,7,37,9],[102,1,102,4],[102,5,102,6],[93,1,93,11],[98,1,98,4],[98,5,98,6],[99,1,99,4],[99,5,99,6],[100,1,100,4],[100,5,100,6],[95,1,95,4],[95,5,95,6],[96,1,96,4],[96,5,96,6],[97,1,97,4],[97,5,97,6]]}
[]
[]
[]
[]
[]
[]
[null,"Residential Affordability Assessment"]
[]
[null,"Application Name",null,null,null,"Adviser Name",null,null,null,"Date Completed"]
[]
[null,"Product Type",null,null,null,"Product Rate"]
[]
[null,"No. of applicants ",null,null,null,"No. of adults residing in property",null,null,null,"No. of dependant children residing in property"]
[null,null,null,{"$f":"IF(AND(D13=1,H13=\"2+\"),\"Number of Adults Higher than Number of Applicants\",\"\")","v":""}]
[null,"Loan Required"]
[]
[null,"Type of mortgage required"]
[]
[null,"Mortgage required £"]
[]
[null,"Part & Part",null,"Capital & Interest",null,null,null,"Interest-Only"]
[]
[null,"Value of property",null,null,null,null,null,"Loan to Value",null,{"$f":"IFERROR(F19/F23,\"\")","v":""}]
[]
[null,"Term required (years) ",null,null,null,null,null,"(Max: 40 yrs C&I/P&P, 30 yrs I/O)"]
[]
[null,"Income"]
[]
[null,"Applicant 1",null,"Annual Gross Income",null,null,null,"Applicant 2",null,"Annual Gross Income"]
[null,null,null,"Reliable Annual Overtime / Bonus",null,null,null,null,null,"Reliable Annual Overtime / Bonus"]
[null,"Average Net Monthly Income (Inclusive of bonus)",null,null,null,null,{"$f":"IF(AND(F29<>\"\",F31=\"\"),1,0)","v":0},"Average Net Monthly Income (Inclusive of bonus)",null,null,null,null,{"$f":"IF(AND(L29<>\"\",L31=\"\"),1,0)","v":0}]
[null,null,null,"Land & Property Income (Gross)",null,null,null,null,null,"Land & Property Income (Gross)"]
[null,null,null,"Land & Property Income (Net)",null,null,null,null,null,"Land & Property Income (Net)"]
[null,null,null,"Other Monthly Income",null,null,null,null,null,"Other Monthly Income"]
[null,null,null,null,null,{"$f":"IFERROR(F31*(F29/(F29+F30))+(F31*(F30/(F29+F30))*0.5)+(F33*0.5)+(F34*0.5),0)","v":0},null,null,null,null,null,{"$f":"IFERROR(L31*(L29/(L29+L30))+(L31*(L30/(L29+L30))*0.5)+(L33*0.5)+(L34*0.5),0)","v":0}]
[null,"Applicant 3",null,"Annual Gross Income",null,null,null,"Applicant4",null,"Annual Gross Income"]
[null,null,null,"Reliable Annual Overtime / Bonus",null,null,null,null,null,"Reliable Annual Overtime / Bonus"]
[null,"Average Net Monthly Income (Inclusive of bonus)",null,null,null,null,{"$f":"IF(AND(F36<>\"\",F38=\"\"),1,0)","v":0},"Average Net Monthly Income (Inclusive of bonus)",null,null,null,null,{"$f":"IF(AND(L36<>\"\",L38=\"\"),1,0)","v":0}]
[null,null,null,"Land & Property Income (Gross)",null,null,null,null,null,"Land & Property Income (Gross)"]
[null,null,null,"Land & Property Income (Net)",null,null,null,null,null,"Land & Property Income (Net)"]
[null,null,null,"Other Monthly Income",null,null,null,null,null,"Other Monthly Income",null,null,{"$f":"SUM(G31,G38,M38,M31)","v":0}]
[null,null,null,null,null,{"$f":"IFERROR(F38*(F36/(F36+F37))+(F38*(F37/(F36+F37))*0.5)+(F40*0.5)+(F41*0.5),0)","v":0},null,null,null,null,null,{"$f":"IFERROR(L38*(L36/(L36+L37))+(L38*(L37/(L36+L37))*0.5)+(L40*0.5)+(L41*0.5),0)","v":0}]
[null,"Expenditure"]
[]
[null,"Applicant 1",null,"Loans/HP (Monthly Repayments)",null,null,null,"Applicant 2",null,"Loans/HP (Monthly Repayments)"]
[null,null,null,"Credit Card (Total Balances)",null,null,null,null,null,"Credit Card (Total Balances)"]
[null,null,null,"Other Unsecured Monthly Pmts",null,null,null,null,null,"Other Unsecured Monthly Pmts"]
[null,null,null,"School/Nursery Fees",null,null,null,null,null,"School/Nursery Fees"]
[null,null,null,"Other (Monthly Payments)",null,null,null,null,null,"Other (Monthly Payments)"]
[null,null,null,null,null,{"$f":"F45+(F46*3%)+F47+F48+F49","v":0},null,null,null,null,null,{"$f":"L45+(L46*3%)+L47+L48+L49","v":0}]
[null,"Applicant 3",null,"Loans/HP (Monthly Repayments)",null,null,null,"Applicant 4",null,"Loans/HP (Monthly Repayments)"]
[null,null,null,"Credit Card (Total Balances)",null,null,null,null,null,"Credit Card (Total Balances)"]
[null,null,null,"Other Unsecured Monthly Pmts",null,null,null,null,null,"Other Unsecured Monthly Pmts"]
[null,null,null,"School/Nursery Fees",null,null,null,null,null,"School/Nursery Fees"]
[null,null,null,"Other (Monthly Payments)",null,null,null,null,null,"Other (Monthly Payments)"]
[null,null,null,null,null,{"$f":"F51+(F52*3%)+F53+F54+F55","v":0},null,null,null,null,null,{"$f":"L51+(L52*3%)+L53+L54+L55","v":0}]
[null,"Affordability Calculation"]
[]
[null,"Total Amount Requested",null,null,null,{"$f":"' VBS Criteria'!M11","v":0}]
[]
[null,"Maximum Capital & Interest loan (£)",null,null,null,{"$f":"IFERROR(' VBS Criteria'!P28,\"\")","v":""},null,"Outcome",null,{"$f":"IFERROR(\nIF(M41>0,\"Please enter net income figure\",\nIF($F$59>=F61*1.3,\"Fail\",\nIF($F$59>=F61*1.1,\"Max Loan Only - refer to Intermediary Team\",\nIF($F$59>=F61*0.85,\"Refer to Intermediary Team\",\"Pass\")))),\"\")","v":""}]
[]
[null,"Maximum Interest Only loan  (£)",null,null,null,{"$f":"' VBS Criteria'!P36","v":{"$error":"#VALUE!"}},null,"Outcome",null,{"$f":"IF(F63>F23*0.6,\"Interest-only above 60% LTV - refer\",IF($F$59>=F63*1.05,\"Max Loan Only\",IF($F$59>=F63*0.95,\"Refer to Intermediary Team\",\"Pass\")))","v":{"$error":"#VALUE!"}}]
[]
[null,"Maximum Part & Part loan (£)",null,null,null,{"$f":"' VBS Criteria'!P52","v":{"$error":"#VALUE!"}},null,"Outcome",null,{"$f":"IF($F$59>=F65*1.1,\"Max Loan Only\",IF($F$59>=F65*0.95,\"Refer to Intermediary Team\",\"Pass\"))","v":{"$error":"#VALUE!"}}]
[]
[null,"Documentation Requirement"]
[null,"Employed",null,null,null,"Self-Employed",null,null,null,"Bank Statements"]
[null,{"$f":"IFERROR(VLOOKUP(' VBS Criteria'!M40,'Guidance Notes'!B35:I38,2,FALSE),\"\")","v":"4 months* \n(or 3  months worth where pay frequency is less than monthly) \nIf payslip is less than period 4 or bonus/overtime is being used then please provide latest P60"},null,null,null,{"$f":"IFERROR(VLOOKUP(' VBS Criteria'!M40,'Guidance Notes'!B35:I38,7,FALSE),\"\")","v":"Latest 2 years Tax calculation summaries\nHMRC Tax year overviews and \nLatest years accounts\n3 months business bank statements"},null,null,null,{"$f":"IFERROR(VLOOKUP(' VBS Criteria'!M40,'Guidance Notes'!B35:I38,8,FALSE),\"\")","v":"3 months personal main bank statements for all applicants including joint accounts"}]
[]
[]
[null,"Guidance Notes"]
[]
[null,"Income"]
[null,"Annual Gross Income",null,null,"Employed - Basic Pay only Self Employed - Dividends or Net Profit (2yr Avg) plus salary - Retired - Annual Gross Pension Income"]
[null,"Annual Overtime / Bonus",null,null,"Employed Only - Annual value of bonus, overtime, car allowance or other enhancements received - P60 will be required to support reliability of income"]
[null,"Net Monthly Income",null,null,"Employed/Retired - Monthly total income after tax (including bonus/overtime etc)  Self-Employed - Declared Gross income after tax"]
[null,"Land & Property Income (Gross)",null,null,"Please enter the applicants profit from property rental income (minus mortgage payments and not based solely on SA302 computation)"]
[null,"Land & Property Income (Net)",null,null,"Gross Amount delared minus tax"]
[null,"Other Income",null,null,"Benefit income (see policy for acceptable benefits) - Any other income types, please discuss with Intermediary Sales Team "]
[null,"Expenditure"]
[null,"Loans/HP (Monthly Repayments)",null,null,"Cumulative monthly payments per applicant"]
[null,"Credit Card (Balances)",null,null,"Total value of all credit cards held per applicant excluding regularly cleared credit cards"]
[null,"Other Unsecured Monthly Pmts",null,null,"Catalogues, credit agreements with over 3 months to run,"]
[null,"School/Nursery Fees",null,null,"Fees to be stated on a monthly basis. Please advise the Intermediary Sales Team if these fees are due to end. "]
[null,"Other (Monthly Payments)",null,null,"Example - Service charges or any regular bon-essential monthly expenditure items over £100pm"]
[null,"Other"]
[null,"Product Type",null,null,"5 Year Fixed and Discounted products are assessed against a lower stressed rate. This may change the maximum loan requested"]
[null,"Product Rate",null,null,"The product rate is required where a 5 year product has been selected. This allows us to assess affordability accurately"]
[null,"Affordability Assessment",null,null,"The assessment is based on ONS figures. Please advise the Intermediary Sales Team if you believe expenditure to be higher than average."]
[null,{"$f":"CONCATENATE(\"Stress Rate Used - \",' VBS Criteria'!C43)","v":"Stress Rate Used - 8.7"},"%"]
[]
[]
[null,"Affordability Overview"]
[]
[null,"Repayment Type",null,null,null,{"$f":"' VBS Criteria'!M15","v":0},null,null,null,"Gross Income Used",null,{"$f":"' VBS Criteria'!M21","v":0}]
[null,"Maximum Affordable Loan",null,null,null,{"$f":"IF(F96=\"Capital & Interest\",' VBS Criteria'!P21,IF(F96=\"Interest Only\",' VBS Criteria'!P31,IF(F96=\"Part & Part\",' VBS Criteria'!P46,\"\")))","v":""},null,null,null,"Net Monthly Income Used",null,{"$f":"' VBS Criteria'!M22","v":0}]
[null,"Maximum Affordable Loan Multiple",null,null,null,{"$f":"IFERROR(F97/' VBS Criteria'!M21,\"\")","v":""},null,null,null,"ONS Total",null,{"$f":"' VBS Criteria'!M24","v":{"$error":"#VALUE!"}}]
[null,"4.5x income",null,null,null,{"$f":"IF(F96=\"Capital & Interest\",' VBS Criteria'!P23,IF(F96=\"Interest Only\",' VBS Criteria'!P33,IF(F96=\"Part & Part\",' VBS Criteria'!P48,\"\")))","v":""},null,null,null,"Council Tax",null,{"$f":"' VBS Criteria'!M25","v":{"$error":"#N/A"}}]
[null,"5x Income",null,null,null,{"$f":"IF(F96=\"Capital & Interest\",' VBS Criteria'!P24,IF(F96=\"Interest Only\",\"N/A\",IF(F96=\"Part & Part\",' VBS Criteria'!P49,\"\")))","v":""},null,null,null,"Commitments and Declared Expenditure",null,{"$f":"' VBS Criteria'!M26","v":0}]
[null,"90% of affordable Loan (>4.5x)",null,null,null,{"$f":"IF(F96=\"Capital & Interest\",' VBS Criteria'!P22,IF(F96=\"Interest Only\",\"N/A\",IF(F96=\"Part & Part\",' VBS Criteria'!P47,\"\")))","v":""},null,null,null,"Total Expenditure",null,{"$f":"' VBS Criteria'!M27","v":{"$error":"#VALUE!"}}]
[]
[null,"Maximum Loan Available",null,null,null,{"$f":"IF(F96=\"Capital & Interest\",' VBS Criteria'!P28,IF(F96=\"Interest Only\",' VBS Criteria'!P36,IF(F96=\"Part & Part\",' VBS Criteria'!P52,\"\")))","v":""},null,null,null,"Amount Available for Mortgage",null,{"$f":"' VBS Criteria'!M29","v":{"$error":"#VALUE!"}}]
[]
[null,null,null,null,null,null,null,null,null,"Payment at Stressed rate",null,{"$f":"IF(F96=\"Capital & Interest\",' VBS Criteria'!P25,IF(F96=\"Interest Only\",' VBS Criteria'!P34,IF(F96=\"Part & Part\",' VBS Criteria'!P44,\"\")))","v":""}]
[]
[null,null,null,null,null,null,null,null,null,"Affordability",null,{"$f":"L103-L105","v":{"$error":"#VALUE!"}}]

{"sheet":"PEL","index":1,"n_rows":32,"n_cols":5,"rows_kept":32,"cut":false,"hidden":true,"merged":[[12,0,12,1],[8,3,8,6],[9,3,9,6],[4,3,4,6],[7,3,7,6],[5,3,6,6]]}
["PEL"]
[]
["Proxy Expected Loss"]
[]
[null,"LTV","PEL"]
["BTL",null,7.0000000000000001E-3]
["Holiday BTL",null,7.0000000000000001E-3]
["Mainstream","80% to 90%",0.01]
["Mainstream",">90%",1.0999999999999999E-2]
["Mainstream","<80%",7.0000000000000001E-3]
["Mainstream","<60%",5.4999999999999997E-3]
[]
["LTV Bands",null,"Description"]
[0,0.6,"Less than 60%"]
[0.60000010000000004,0.7,"60 % <70%"]
[0.70000010000000001,0.8,"70%  <80%"]
[0.80000009999999999,0.9,"80%  <90%"]
[0.90000009999999997,0.95,"90% <95%"]
[0.95000000100000004,1,"≥95%"]
[]
["LEL Assumptions"]
[]
["PD Scalar","Current"]
["Resi",2.5]
["BTL",2.7]
["Floors"]
["PD",5.0000000000000001E-4]
["LGD",0.05,"5% on all loans",null,"On loans >50% LTV"]
["Prob (Possession │Default)",0.7]
["Haircut",0.25]
["Sale Cost %",0.1]
["Sale Costs - Cap",30000]

{"sheet":"1 - Main","index":2,"n_rows":100,"n_cols":19,"rows_kept":100,"cut":false,"hidden":true,"merged":[[54,11,54,12],[55,7,55,10],[57,7,57,10],[57,11,57,12],[52,11,52,12],[55,11,55,12],[50,11,50,12],[51,7,51,10],[51,11,51,12],[52,7,52,10],[53,11,53,12],[53,7,53,10],[28,2,28,3],[30,2,30,3],[31,2,31,3],[44,2,44,3],[32,2,32,3],[43,2,43,3],[34,2,34,3],[35,2,35,3],[0,11,0,13],[1,2,1,3],[1,5,1,8],[3,2,3,3],[3,5,3,8],[0,5,0,9],[5,2,5,3],[5,5,5,8],[7,2,7,3],[7,5,7,8],[23,2,23,3],[13,2,13,3],[21,2,21,3],[15,2,15,3],[11,2,11,3],[17,2,17,3],[19,2,19,3],[9,2,9,3],[13,7,13,9],[87,2,87,3],[87,5,87,6],[13,10,13,11],[36,2,36,3],[37,2,37,3],[38,2,38,3],[40,2,40,3],[41,2,41,3],[39,2,39,3],[26,2,26,3],[42,2,42,3],[45,2,45,3],[65,2,65,5],[50,7,50,10],[54,7,54,10],[48,3,48,17],[98,14,98,17],[60,11,60,12],[60,7,60,10],[13,13,13,15],[87,7,87,17],[63,2,63,17],[58,7,58,10],[58,11,58,12],[59,7,59,10],[59,11,59,12],[73,3,73,5],[67,2,67,5],[69,2,69,5],[68,2,68,5],[75,3,75,5],[76,3,76,5],[99,2,99,17],[93,2,94,2],[93,3,93,13],[93,14,94,17],[94,3,94,7],[94,8,94,11],[94,12,94,13],[95,3,95,7],[95,8,97,11],[95,12,96,13],[95,14,96,17],[96,3,96,7],[97,3,98,7],[97,12,98,13],[97,14,97,17],[98,8,98,11]]}
[null,null,null,null,null,"Residential Affordability Calculator",null,null,null,null,null,"Mortgage Affordability Calculator - 20.0 - February 2025"]
[null,null,"Borrower name(s)",null,null,null,null,null,null,null,"Prepared by:"]
[]
[null,null,"Application number",null,null,null,null,null,null,null,"Date prepared:"]
[]
[null,null,"Product Type"]
[]
[null,null,"Product Rate"]
[]
[null,null,"Type of mortgage required",null,null,null,null,{"$f":"IF(F12=\"\",\"\",IFERROR(IF(AND(OR(F10='Drop down'!C3,F10='Drop down'!#REF!),H16>60),\"WARNING LOAN EXCEEDS 60% LTV\",\"\"),\"\"))","v":""}]
[]
[null,null,"Mortgage required £"]
[]
[null,null,"Part & Part                                                  Capital & Interest",null,null,null,null,"Interest-Only"]
[]
[null,null,"Value of property",null,null,null,null,{"$f":"IFERROR(((' VBS Criteria'!G11)/F16)*100,\"\")","v":""},"%"]
[]
[null,null,"Term required (years) (Max: 40 yrs C&I, 30 yrs I/O)",null,null,null,null,{"$f":"IF(AND(OR(F10='Drop down'!C3),F18>30),\"WARNING LOAN EXCEEDS MAX 30 YEAR TERM (N/A FOR RIO)\",\"\")","v":""}]
[]
[null,null,"Number of applicants "]
[]
[null,null,"Household - Number of adults residing in property",null,null,null,null,{"$f":"IF(AND(F20=1,F22=\"2+\"),\"Adults in property higher than applicants - please refer\",\"\")","v":""}]
[]
[null,null,"Number of dependant children residing in property",null,null,0]
[]
[null,null,null,null,null,"Applicant 1",null,"Applicant 2",null,"Applicant 3",null,"Applicant 4"]
[null,null,"Credit Score"]
[]
[null,null,"Total Gross Annual Income",null,null,{"$f":"'2 - Income'!H30","v":0},null,{"$f":"'2 - Income'!P30","v":0},null,{"$f":"'2 - Income'!H62","v":0},null,{"$f":"'2 - Income'!P62","v":0}]
[]
[null,null,"Net Monthly income ",null,null,{"$f":"'2 - Income'!H31/12","v":0},null,{"$f":"'2 - Income'!P31/12","v":0},null,{"$f":"'2 - Income'!H63/12","v":0},null,{"$f":"'2 - Income'!P63/12","v":0}]
[null,null,"Monthly committed expenditure:"]
[null,null,"Unsecured Credit Commitments",null,null,{"$f":"'3 - Debt'!M4","v":0},null,{"$f":"'3 - Debt'!M5","v":0},null,{"$f":"'3 - Debt'!M6","v":0},null,{"$f":"'3 - Debt'!M7","v":0}]
[]
[null,null,"Essential expenditure & basic standard of living costs:",null,"ONS Category","Amount Used",null,null,null,null,null,null,null,"Affordability based on",null,"ONS","Higher Amount","Override"]
[null,null,"Council tax",null,"n/a",{"$f":"'4 - Expenditure'!J4","v":0},null,null,null,null,null,null,null,{"$f":"'4 - Expenditure'!K4","v":""},null,null,{"$f":"F36","v":0}]
[null,null,"Ground rent / service charge",null,4,{"$f":"'4 - Expenditure'!G5","v":0},null,null,null,null,null,null,null,{"$f":"'4 - Expenditure'!K5","v":""},null,null,{"$f":"F37","v":0}]
[null,null,"Home Fuel & Utility Bills",null,4,{"$f":"'4 - Expenditure'!G6","v":0},null,null,null,null,null,null,null,{"$f":"'4 - Expenditure'!K6","v":""},null,{"$f":"IFERROR(HLOOKUP(' VBS Criteria'!G19,'ONS Update'!$C$5:$J$17,5,FALSE),\"\")","v":""},{"$f":"IF(R38>0,R38,(IF(P38>(F38),P38,F38)))","v":""},0,{"$f":"IF(AND(F38<P38,$F$12>$H$66),1,0)","v":0}]
[null,null,"Food, groceries, toiletries and cleaning products",null,"1, 5 and 12",{"$f":"'4 - Expenditure'!G7","v":0},null,null,null,null,null,null,null,{"$f":"'4 - Expenditure'!K7","v":""},null,{"$f":"IFERROR(HLOOKUP(' VBS Criteria'!G19,'ONS Update'!$C$5:$J$17,2,FALSE)+(HLOOKUP(' VBS Criteria'!G19,'ONS Update'!$C$5:$J$17,6,FALSE)*50%)+(HLOOKUP(' VBS Criteria'!G19,'ONS Update'!$C$5:$J$17,13,FALSE)*31%),\"\")","v":""},{"$f":"IF((J39+F39)>P39,(J39+F39),P39)","v":""}]
[null,null,"Essential Travel Costs (exclude car insurance)",null,7,{"$f":"'4 - Expenditure'!G8","v":0},null,null,null,null,null,null,null,{"$f":"'4 - Expenditure'!K8","v":""},null,{"$f":"IFERROR(HLOOKUP(' VBS Criteria'!G19,'ONS Update'!$C$5:$J$17,8,FALSE),\"\")","v":""},{"$f":"IF(R40>0, R40,(IF(P40>(F40+J40),P40,F40+J40)))","v":""},0,{"$f":"IF(AND(F40<P40,$F$12>$H$66),1,0)","v":0}]
[null,null,"Essential Insurances (include car insurance if applicable)",null,12,{"$f":"'4 - Expenditure'!G9","v":0},null,null,null,null,null,null,null,{"$f":"'4 - Expenditure'!K9","v":""},null,{"$f":"IFERROR(HLOOKUP(' VBS Criteria'!G19,'ONS Update'!$C$5:$J$17,13,FALSE)*69%,\"\")","v":""},{"$f":"IF(R41>0, R41,(IF(P41>(F41+J41),P41,F41+J41)))","v":""},0,{"$f":"IF(AND(F41<P41,$F$12>$H$66),1,0)","v":0}]
[null,null,"Telephones / Internet / TV and Satellite costs",null,"8 & 9",{"$f":"'4 - Expenditure'!G10","v":0},null,null,null,null,null,null,null,{"$f":"'4 - Expenditure'!K10","v":""},null,{"$f":"IFERROR(HLOOKUP(' VBS Criteria'!G19,'ONS Update'!$C$5:$J$17,9,FALSE)+(HLOOKUP(' VBS Criteria'!G19,'ONS Update'!$C$5:$J$17,10,FALSE)*35%),\"\")","v":""},{"$f":"IF(R42>0, R42,(IF(P42>(F42+J42),P42,F42+J42)))","v":""},0,{"$f":"IF(AND(F42<P42,$F$12>$H$66),1,0)","v":0}]
[null,null,"Childcare (include School Fees if applicable)",null,null,{"$f":"'4 - Expenditure'!G11","v":0},null,null,null,null,null,null,null,{"$f":"'4 - Expenditure'!K11","v":""},null,null,{"$f":"F43+J43","v":0}]
[null,null,"Clothing and Footwear",null,3,{"$f":"'4 - Expenditure'!G12","v":0},null,null,null,null,null,null,null,{"$f":"'4 - Expenditure'!K12","v":""},null,{"$f":"IFERROR(HLOOKUP(' VBS Criteria'!G19,'ONS Update'!$C$5:$J$17,4,FALSE),\"\")","v":""},{"$f":"IF((J44+F44)>P44,(J44+F44),P44)","v":""}]
[null,null,"Other Noted Expenditure (from expenditure tab)",null,null,{"$f":"'4 - Expenditure'!J24","v":0},null,null,null,null,null,null,null,{"$f":"IF(F45>0,\"See tab 4\",\"\")","v":""},null,null,{"$f":"F45","v":0}]
[null,null,"Higher of ONS Miscellaneous Expenditure or 5% of Income",null,null,{"$f":"IF(SUM(F31:L31)=0,0,MIN((' VBS Criteria'!G21*' VBS Criteria'!B4),' VBS Criteria'!J51))","v":0},null,null,null,null,null,null,null,{"$f":"IFERROR(IF(F46>P46,\"5% of Income\",\"ONS\"),\"\")","v":"ONS"},null,{"$f":"IFERROR(HLOOKUP(' VBS Criteria'!G19,'ONS Update'!$C$5:$J$17,3,FALSE)+(HLOOKUP(' VBS Criteria'!G19,'ONS Update'!$C$5:$J$17,6,FALSE)*50%)+HLOOKUP(' VBS Criteria'!G19,'ONS Update'!$C$5:$J$17,7,FALSE)+(HLOOKUP(' VBS Criteria'!G19,'ONS Update'!$C$5:$J$17,10,FALSE)*65%)+HLOOKUP(' VBS Criteria'!G19,'ONS Update'!$C$5:$J$17,11,FALSE),\"\")","v":""},{"$f":"IF(J46+F46>P46,F46,P46)","v":""}]
[]
[]
[null,null,null,"Affordability Overview"]
[]
[null,null,null,"Total Net Income",null,{"$f":"' VBS Criteria'!G21","v":0},null,"Repayment Type",null,null,null,{"$f":"' VBS Criteria'!G15","v":0}]
[null,null,null,"Essential Expenditure",null,{"$f":"SUM(Q36:Q46)","v":0},null,"Maximum Affordable Loan",null,null,null,{"$f":"IF(' VBS Criteria'!G15=\"Capital & Interest\",' VBS Criteria'!J11,IF(' VBS Criteria'!G15=\"Interest Only\",' VBS Criteria'!J22,IF(' VBS Criteria'!G15=\"Part & Part\",' VBS Criteria'!J38,\"\")))","v":""}]
[null,null,null,"Unsecured Credit Commitments",null,{"$f":"SUM(F33,H33,J33,L33)","v":0},null,"Maximum Affordable Loan Multiple",null,null,null,{"$f":"IFERROR(L52/' VBS Criteria'!G20,\"\")","v":""}]
[null,null,null,"Expenditure Total",null,{"$f":"SUM(F52:F53)","v":0},null,"4.5x income",null,null,null,{"$f":"IF(' VBS Criteria'!G15=\"Capital & Interest\",' VBS Criteria'!J14,IF(' VBS Criteria'!G15=\"Interest Only\",' VBS Criteria'!J25,IF(' VBS Criteria'!G15=\"Part & Part\",' VBS Criteria'!J40,\"\")))","v":""}]
[null,null,null,null,null,null,null,"5x Income",null,null,null,{"$f":"IF(' VBS Criteria'!G15=\"Capital & Interest\",' VBS Criteria'!J15,IF(' VBS Criteria'!G15=\"Interest Only\",\"N/A\",IF(' VBS Criteria'!G15=\"Part & Part\",' VBS Criteria'!J41,\"\")))","v":""}]
[null,null,null,"Income available for mortgage repayment",null,{"$f":"' VBS Criteria'!G28","v":0},null,{"$f":"IF(' VBS Criteria'!B32<>\"Standard\",\"85% of Maximum affordable loan\",\"90% of affordable Loan (>4.5x)\")","v":"90% of affordable Loan (>4.5x)"},null,null,null,{"$f":"IF(' VBS Criteria'!G15=\"Capital & Interest\",' VBS Criteria'!J18,IF(' VBS Criteria'!G15=\"Interest Only\",\"N/A\",IF(' VBS Criteria'!G15=\"Part & Part\",' VBS Criteria'!J43,\"\")))","v":""}]
[null,null,null,"Stressed Mortgage Payment",null,{"$f":"IFERROR(IF(AND(' VBS Criteria'!G22=\"No\",' VBS Criteria'!G23=\"No\"),' VBS Criteria'!J16,IF(' VBS Criteria'!G22=\"Yes\",' VBS Criteria'!J26,IF(' VBS Criteria'!G23=\"Yes\",' VBS Criteria'!J36,\"\"))),0)","v":0}]
[null,null,null,"Surplus Income Against Stress",null,{"$f":"F56-F57","v":0},null,"Maximum Loan Available",null,null,null,{"$f":"IF(' VBS Criteria'!G15=\"Capital & Interest\",' VBS Criteria'!J19,IF(' VBS Criteria'!G15=\"Interest Only\",' VBS Criteria'!J28,IF(' VBS Criteria'!G15=\"Part & Part\",' VBS Criteria'!J44,\"\")))","v":""}]
[]
[null,null,null,"Mortgage Payment - Product Rate",null,{"$f":"IFERROR(IF(AND(' VBS Criteria'!G22=\"No\",' VBS Criteria'!G23=\"No\"),' VBS Criteria'!J47,IF(' VBS Criteria'!G22=\"Yes\",' VBS Criteria'!J48,IF(' VBS Criteria'!G23=\"Yes\",' VBS Criteria'!J49,\"\"))),0)","v":0},null,"Loan as % of Max Affordable Loan",null,null,null,{"$f":"IFERROR(IF(L58<J66,L58,J66)/L52,\"\")","v":""},null,"Check 3.7.1 of Standard Residential Core Criteria for restrictions on use"]
[null,null,null,"Surplus Income Against Product Rate",null,{"$f":"F56-F60","v":0},null,null,null,null,null,null,null,"of Max Affordable Loan dependent on the Stressed Rate used."]
[null,null,null,"PEL Trigger",null,{"$f":"IF(F27=\"\",\"\",IFERROR(' VBS Criteria'!G63,\"\"))","v":""}]
[]
[null,null,"Affordability Outcome (Subject to Underwriting)"]
[null,null,null,null,null,null,null,"Max Loan",null,"Loan Requested",null,"Decision"]
[null,null,"Maximum Capital & Interest loan based on data input (£)",null,null,null,null,{"$f":"' VBS Criteria'!J19","v":0},null,{"$f":"' VBS Criteria'!G11","v":0},null,{"$f":"IF(J66=0,\"\",IFERROR(IF(J66>=H66*1.3,\"Fail\",IF(J66>=H66*1.1,\"Max Loan Only - refer to Intermediary Team\",IF(J66>=H66*0.95,\"Refer to Intermediary Team\",\"Pass\"))),\"\"))","v":""}]
[]
[null,null,"Maximum Interest Only loan based on data input (£)",null,null,null,null,{"$f":"' VBS Criteria'!J28","v":0},null,{"$f":"' VBS Criteria'!G11","v":0},null,{"$f":"IF(J68=0,\"\",IFERROR(IF(J68>=H68*1.3,\"Fail\",IF(J68>=H68*1.1,\"Max Loan Only - refer to Intermediary Team\",IF(J68>=H68*0.95,\"Refer to Intermediary Team\",\"Pass\"))),\"\"))","v":""}]
[]
[null,null,"Maximum Part and Part loan based on data input (£)",null,null,null,null,{"$f":"' VBS Criteria'!J44","v":0},null,{"$f":"' VBS Criteria'!G11","v":0},null,{"$f":"IF(J70=0,\"\",IFERROR(IF(J70>=H70*1.3,\"Fail\",IF(J70>=H70*1.1,\"Max Loan Only - refer to Intermediary Team\",IF(J70>=H70*0.95,\"Refer to Intermediary Team\",\"Pass\"))),\"\"))","v":""}]
[]
[]
[]
[null,null,null,"\nIncome multiple based on mortgage required (for info)",null,null,null,{"$f":"IFERROR(MAX(F12,SUM(F14,K14))/(F29+H29+J29+L29),\"\")","v":""},null,{"$f":"IFERROR(IF(OR(AND(F22=1,H74>4.5),AND(F22>1,H74>4)),\"High income multiple\",\"\"),\"\")","v":""},null,null,null,{"$f":"CONCATENATE(\"Stress Rate Used - \",' VBS Criteria'!B43)","v":"Stress Rate Used - 8.7"},"%"]
[]
[null,null,null,"Capital & Interest"]
[null,null,null,"requested loan as % of max affordable C&I loan ",null,null,null,{"$f":"IFERROR(ROUNDUP(' VBS Criteria'!G11/' VBS Criteria'!J11*100,1),\"\")","v":""},"%"]
[null,null,null,"Surplus income after stressed C&I mortgage repayment(£) and (%)",null,null,null,{"$f":"IFERROR(' VBS Criteria'!G28-' VBS Criteria'!J16,\"\")","v":""},null,{"$f":"IFERROR((' VBS Criteria'!$G$28-' VBS Criteria'!$J$16)/' VBS Criteria'!$G$21,\"\")","v":""}]
[]
[null,null,null,"Interest Only"]
[null,null,null,"requested loan as % of max affordable I/O loan ",null,null,null,{"$f":"IFERROR(ROUNDUP(' VBS Criteria'!G11/(' VBS Criteria'!J22)*100,1),\"\")","v":""},"%"]
[null,null,null,"Surplus income after stressed I/O mortgage repayment(£) and (%)",null,null,null,{"$f":"' VBS Criteria'!G28-' VBS Criteria'!J26","v":0},null,{"$f":"IFERROR((' VBS Criteria'!$G$28-' VBS Criteria'!$J$26)/' VBS Criteria'!$G$21,\"\")","v":""}]
[]
[null,null,null,"Part & Part"]
[null,null,null,"requested loan as % of max affordable I/O loan ",null,null,null,{"$f":"IFERROR(ROUNDUP(' VBS Criteria'!G11/(' VBS Criteria'!J24)*100,1),\"\")","v":""},"%"]
[null,null,null,"Surplus income after stressed I/O mortgage repayment(£) and (%)",null,null,null,{"$f":"' VBS Criteria'!G28-' VBS Criteria'!J36","v":{"$error":"#NUM!"}},null,{"$f":"IFERROR((' VBS Criteria'!$G$28-' VBS Criteria'!J36)/' VBS Criteria'!$G$21,\"\")","v":""}]
[]
[null,null,"Documentary evidence level -",null,null,{"$f":"IFERROR(' VBS Criteria'!G42,\"\")","v":""},null,"refer to guidance notes for details of evidence requirements "]
[]
[]
[]
[]
[]
[null,null,"Level","Income evidence requirements",null,null,null,null,null,null,null,null,null,null,"Additional evidence requirements"]
[null,null,null,"Employed",null,null,null,null,"Self-employed",null,null,null,"Retired"]
[null,null,1,"1 month* (or 1 months worth where pay frequency is less than monthly) recent payslip which must show a YTD figure including more than 4 months salary, where this is not possible an additional payslip meeting this requirement or P60",null,null,null,null,"Latest 2 years Tax calculation summaries supported by the HMRC Tax year overviews and latest years accounts.",null,null,null,"Pension statement or 1 month pension advice slip (dated within the last 3months) Where >3 months old an additional Bank Statement showing pension credit",null,"None"]
[null,null,2,"2 months* (or 2 months worth where pay frequency is less than monthly) recent payslip which must show a YTD figure including more than 4 months salary, where this is not possible an additional payslip meeting this requirement or P60"]
[null,null,3,"3 months* (or 3 months worth where pay frequency is less than monthly) recent payslip which must show a YTD figure including more than 4 months salary, where this is not possible an additional payslip meeting this requirement or P60",null,null,null,null,null,null,null,null,"Pension Statement dated within the last 3 months & P60,  Where statement >3 months main Bank Statements must show pension credit ",null,"1 months personal main bank statement"]
[null,null,4,null,null,null,null,null,"Above plus 3 months business bank statements",null,null,null,null,null,"3 months personal main bank statements"]
[null,null,"*Note - Where Basic Salary fluctuates each month or additional income (e.g. Bonuses / Overtime/ Allowances) is used additional evidence may be requested e.g. P60."]

{"sheet":"Drop down","index":3,"n_rows":41,"n_cols":21,"rows_kept":41,"cut":false,"hidden":true,"merged":[[1,14,4,14],[0,14,0,19],[7,20,10,20],[6,14,6,19]]}
["Term of mort",null,"Type of mort",null,"Dependants","calculation","Number of applicants","Calculation","Stressed Rate","Source",null,"Decision","Mortgage Type",null,"Matrix "]
[1,null,"Capital & Interest",null,0,0,1,1,"Standard","Adviser Input",null,"Pass","Residential",null,"LTV","=90>=95",2,3,4,4]
[2,null,"Interest Only",null,1,10,"2+",2,"5-Year Fixed","Bank Statement",null,"Fail","Self-Build",null,null,"=80>90",2,3,4,4]
[3,null,"Part & Part",null,2,20,null,null,"5-Year Discount","Underwriter Input",null,"Marginal Pass",null,null,null,"=60>80",1,2,3,4]
[4,null,null,null,"3+",30,null,null,null,null,null,"Refer",null,null,null,"<60",1,2,3,4]
[5,null,"Source",null,null,null,null,null,null,null,null,null,null,null,null,null,"<75","75>=90","90>=95","95>=100"," % of max affordabe loan used"]
[6,null,"Broker",null,null,null,null,null,null,null,null,null,null,null,"Calculations"]
[7,null,"Direct",null,null,null,null,null,null,null,null,null,null,null,"LTV",null,null,null,null,null,"LTV"]
[8,null,null,null,null,null,null,null,null,null,null,null,null,null,"=90>=95",3,{"$f":"Q$13*$P9","v":3},{"$f":"R$13*$P9","v":15},36,75]
[9,null,null,null,null,null,null,null,null,null,null,null,null,null,"=80>90",2.5,2.5,12.5,30,62.5]
[10,null,null,null,null,null,null,null,null,null,null,null,null,null,"=60>80",2,2,10,24,50]
[11,null,null,null,null,null,null,null,null,null,null,null,null,null,"<60",1,{"$f":"Q$13*$P12","v":1},{"$f":"R$13*$P12","v":5},{"$f":"S$13*$P12","v":12},{"$f":"T$13*$P12","v":25}]
[12,null,null,null,null,null,null,null,null,null,null,null,null,null,null,null,1,5,12,25]
[13,null,null,null,null,null,null,null,null,null,null,null,null,null,null,null,"<75","75>=90","90>=95","95>=100"," % of max affordability used"]
[14]
[15,null,null,null,null,null,null,null,null,null,null,null,null,null,"LTV",null,"Affordability",null,"Decision","Upper LTI"]
[16,null,null,null,null,null,null,null,null,null,null,null,null,null,0,1,0,1,"Pass","Refer to Underwriter"]
[17,null,null,null,null,null,null,null,null,null,null,null,null,null,60,2,75,5,"Pass","Refer to Underwriter"]
[18,null,null,null,null,null,null,null,null,null,null,null,null,null,80,2.5,90,12,"Pass","Fail"]
[19,null,null,null,null,null,null,null,null,null,null,null,null,null,90,3,95,25,"Marginal Pass","Fail"]
[20,null,null,null,null,null,null,null,null,null,null,null,null,null,100,null,100.01,1000,"Fail","Fail"]
[21]
[22,null,null,null,null,null,null,null,null,null,null,null,null,null,null,"Total of Affordability x LTV "]
[23,null,null,null,null,null,null,null,null,null,null,null,null,null,null,null,"level"]
[24,null,null,null,null,null,null,null,null,null,null,null,null,null,null,0,"Level 1"]
[25,null,null,null,null,null,null,null,null,null,null,null,null,null,null,2,"Level 2"]
[26,null,null,null,null,null,null,null,null,null,null,null,null,null,null,10,"Level 3"]
[27,null,null,null,null,null,null,null,null,null,null,null,null,null,null,24,"Level 4"]
[28]
[29]
[30]
[31]
[32,null,null,null,null,null,null,null,null,null,null,null,null,null,"test"]
[33,null,null,null,null,null,null,null,null,null,null,null,null,null,"LTV",59,{"$f":"VLOOKUP(P34,O17:P21,2,TRUE)","v":1}]
[34,null,null,null,null,null,null,null,null,null,null,null,null,null,"Affordability",74.5,{"$f":"VLOOKUP(P35,Q17:S21,2,TRUE)","v":1},{"$f":"VLOOKUP(P35,Q17:S21,3,TRUE)","v":"Pass"}]
[35,null,null,null,null,null,null,null,null,null,null,null,null,null,null,null,{"$f":"Q34*Q35","v":1},{"$f":"VLOOKUP(Q36,P25:Q28,2,TRUE)","v":"Level 1"}]
[36]
[37]
[38]
[39]
[40]

{"sheet":"Council Tax Bands UK","index":4,"n_rows":298,"n_cols":28,"rows_kept":298,"cut":false,"hidden":true,"merged":[]}
["2023/4 15% buffer","Rates Accessed here",null,null,null,null,null,null,null,null,null,1991,null,"Adjusted",null,"Average","Mth Avg",null,null,"2023/4 Actual"]
[null,"Band A","Band B","Band C","Band D","Band E","Band F","Band G","Band H",null,"Band A",0,40000,0,175000,{"$f":"AVERAGE(B:B)","v":1594.8013125000009},{"$f":"CEILING(P2/12,1)","v":133},null,null,null,"Band A","Band B","Band C","Band D","Band E","Band F","Band G","Band H"]
["Adur",{"$f":"U3*115%","v":1699.9989999999998},{"$f":"V3*115%","v":1983.3244999999999},2266.6614999999997,2549.9984999999997,3116.6609999999996,3683.335,4249.9974999999995,5099.9969999999994,null,"Band B",{"$f":"M2+1","v":40001},52000,{"$f":"O2+1","v":175001},225000,{"$f":"AVERAGE(C:C)","v":1860.5999966216207},{"$f":"CEILING(P3/12,1)","v":156},null,null,"Adur",1478.26,1724.63,1971.01,2217.39,2710.14,3202.9,3695.65,4434.78]
["Allerdale",{"$f":"U4*115%","v":1599.5235},{"$f":"V4*115%","v":1866.105},{"$f":"W4*115%","v":2132.6864999999998},{"$f":"X4*115%","v":2399.2794999999996},{"$f":"Y4*115%","v":2932.4539999999997},{"$f":"Z4*115%","v":3465.6284999999998},{"$f":"AA4*115%","v":3998.8029999999994},{"$f":"AB4*115%","v":4798.5589999999993},null,"Band C",{"$f":"M3+1","v":52001},68000,{"$f":"O3+1","v":225001},300000,{"$f":"AVERAGE(D:D)","v":2126.3988361486481},178,null,null,"Allerdale",1390.89,1622.7,1854.51,2086.33,2549.96,3013.59,3477.22,4172.66]
["Amber Valley",1654.6774999999998,1930.4589999999998,2206.2404999999999,2482.0219999999999,3033.585,3585.1365000000001,4136.6994999999997,4964.0439999999999,null,"Band D",{"$f":"M4+1","v":68001},88000,{"$f":"O4+1","v":300001},385000,{"$f":"AVERAGE(E:E)","v":2392.2018716216198},200,null,null,"Amber Valley",1438.85,1678.66,1918.47,2158.2800000000002,2637.9,3117.51,3597.13,4316.5600000000004]
["Arun",1758.4534999999998,2051.5194999999999,2344.5969999999998,2637.6745000000001,3223.8294999999998,3809.9729999999995,4396.1279999999997,5275.3490000000002,null,"Band E",88001,120000,385001,525000,{"$f":"AVERAGE(F:F)","v":2923.8023479729759},244,null,null,"Arun",1529.09,1783.93,2038.78,2293.63,2803.33,3313.02,3822.72,4587.26]
["Ashfield",1610.5635,1878.9849999999999,2147.4064999999996,2415.8395,2952.6939999999995,3489.5484999999994,4026.4029999999993,4831.6790000000001,null,"Band F",120001,160000,525001,700000,{"$f":"AVERAGE(G:G)","v":3455.401658783785},288,null,null,"Ashfield",1400.49,1633.9,1867.31,2100.73,2567.56,3034.39,3501.22,4201.46]
["Ashford",1559.9634999999998,1819.9554999999998,2079.9589999999998,2339.951,2859.9349999999999,3379.9304999999999,3899.9144999999999,4679.902,null,"Band G",160001,320000,700001,1400000,{"$f":"AVERAGE(H:H)","v":3987.0031841216196},333,null,null,"Ashford",1356.49,1582.57,1808.66,2034.74,2486.9,2939.07,3391.23,4069.48]
["Babergh",1451.0814999999998,1692.9264999999998,1934.7714999999998,2176.6165000000001,2660.3064999999997,3143.9964999999997,3627.6979999999999,4353.2330000000002,null,"Band H",320001,null,1400001,null,{"$f":"AVERAGE(I:I)","v":4784.4037432432397},399,null,null,"Babergh",1261.81,1472.11,1682.41,1892.71,2313.31,2733.91,3154.52,3785.42]
["Barking & Dagenham",1407.7264999999998,1642.3495,1876.9724999999999,2111.5954999999999,2580.8415,3050.0759999999996,3519.3220000000001,4223.1909999999998,null,null,null,null,null,null,null,null,null,null,"Barking & Dagenham",1224.1099999999999,1428.13,1632.15,1836.17,2244.21,2652.24,3060.28,3672.34]
["Barnet",1558.7445,1818.5409999999997,2078.326,2338.1224999999999,2857.7039999999997,3377.2854999999995,3896.8669999999997,4676.2449999999999,null,null,null,null,null,null,null,null,null,null,"Barnet",1355.43,1581.34,1807.24,2033.15,2484.96,2936.77,3388.58,4066.3]
["Barnsley",1581.6179999999997,1845.2209999999998,2108.8239999999996,2372.4269999999997,2899.6329999999998,3426.8389999999999,3954.0450000000001,4744.8539999999994,null,null,null,null,null,null,null,null,null,null,"Barnsley",1375.32,1604.54,1833.76,2062.98,2521.42,2979.86,3438.3,4125.96]
["Barrow-in-Furness",1498.0129999999997,1747.6779999999999,1997.3429999999998,2247.0194999999999,2746.3609999999994,3245.6909999999998,3745.0324999999998,4494.0389999999998,null,null,null,null,null,null,null,null,null,null,"Barrow-in-Furness",1302.6199999999999,1519.72,1736.82,1953.93,2388.14,2822.34,3256.55,3907.86]
["Basildon",1776.3705,2072.4379999999996,2368.4939999999997,2664.5615000000003,3256.6849999999999,3848.8084999999996,4440.9319999999998,5329.1230000000005,null,null,null,null,null,null,null,null,null,null,"Basildon",1544.67,1802.12,2059.56,2317.0100000000002,2831.9,3346.79,3861.68,4634.0200000000004]
["Basingstoke & Deane",1573.2689999999998,1835.4804999999999,2097.6919999999996,2359.9034999999999,2884.3265000000001,3408.7494999999999,3933.1724999999997,4719.8069999999998,null,null,null,null,null,null,null,null,null,null,"Basingstoke & Deane",1368.06,1596.07,1824.08,2052.09,2508.11,2964.13,3420.15,4104.18]
["Bassetlaw",1634.8284999999998,1907.2979999999998,2179.779,2452.2484999999997,2997.1874999999995,3542.1379999999995,4087.0769999999998,4904.4969999999994,null,null,null,null,null,null,null,null,null,null,"Bassetlaw",1421.59,1658.52,1895.46,2132.39,2606.25,3080.12,3553.98,4264.78]
["Bath & North East Somerset",1562.2864999999999,1822.6579999999999,2083.0409999999997,2343.424,2864.1899999999996,3384.9444999999996,3905.7104999999997,4686.848,null,null,null,null,null,null,null,null,null,null,"Bath & North East Somerset",1358.51,1584.92,1811.34,2037.76,2490.6,2943.43,3396.27,4075.52]
["Bedford",1466.6524999999997,1711.085,1955.529,2199.973,2688.8609999999994,3177.7374999999997,3666.6254999999996,4399.9459999999999,null,null,null,null,null,null,null,null,null,null,"Bedford",1275.3499999999999,1487.9,1700.46,1913.02,2338.14,2763.25,3188.37,3826.04]
["Bexley",1674.5840000000001,1953.6774999999998,2232.7709999999997,2511.8759999999997,3070.0744999999997,3628.2615000000001,4186.46,5023.7519999999995,null,null,null,null,null,null,null,null,null,null,"Bexley",1456.16,1698.85,1941.54,2184.2399999999998,2669.63,3155.01,3640.4,4368.4799999999996]
["Birmingham",1625.9965,1896.9939999999997,2168.0029999999997,2439.0004999999996,2980.9955,3523.002,4064.9969999999998,4878.0009999999993,null,null,null,null,null,null,null,null,null,null,"Birmingham",1413.91,1649.56,1885.22,2120.87,2592.17,3063.48,3534.78,4241.74]
["Blaby",1664.3949999999998,1941.7864999999999,2219.1895,2496.5924999999997,3051.3869999999997,3606.1929999999998,4160.9874999999993,4993.1849999999995,null,null,null,null,null,null,null,null,null,null,"Blaby",1447.3,1688.51,1929.73,2170.9499999999998,2653.38,3135.82,3618.25,4341.8999999999996]
["Blackburn with Darwen",1687.211,1968.4089999999999,2249.607,2530.8164999999999,3093.2240000000002,3655.62,4218.0274999999992,5061.6329999999998,null,null,null,null,null,null,null,null,null,null,"Blackburn with Darwen",1467.14,1711.66,1956.18,2200.71,2689.76,3178.8,3667.85,4401.42]
["Blackpool",1567.5534999999998,1828.8104999999998,2090.0675000000001,2351.3245000000002,2873.8384999999994,3396.3524999999995,3918.8779999999992,4702.6490000000003,null,null,null,null,null,null,null,null,null,null,"Blackpool",1363.09,1590.27,1817.45,2044.63,2498.9899999999998,2953.35,3407.72,4089.26]
["Bolsover",1585.2634999999998,1849.4759999999999,2113.6884999999997,2377.9009999999994,2906.3259999999996,3434.7394999999997,3963.1644999999999,4755.8019999999988,null,null,null,null,null,null,null,null,null,null,"Bolsover",1378.49,1608.24,1837.99,2067.7399999999998,2527.2399999999998,2986.73,3446.23,4135.4799999999996]
["Bolton",1575.7645,1838.3899999999996,2101.0155,2363.6410000000001,2888.8919999999998,3414.143,3939.4054999999998,4727.2820000000002,null,null,null,null,null,null,null,null,null,null,"Bolton",1370.23,1598.6,1826.97,2055.34,2512.08,2968.82,3425.57,4110.68]
["Boston",1500.2094999999999,1750.2424999999998,2000.2754999999997,2250.3084999999996,2750.3744999999999,3250.4404999999997,3750.518,4500.6169999999993,null,null,null,null,null,null,null,null,null,null,"Boston",1304.53,1521.95,1739.37,1956.79,2391.63,2826.47,3261.32,3913.58]
["Bracknell Forest",1499.4389999999999,1749.3454999999999,1999.252,2249.1585,2748.9714999999997,3248.7844999999998,3748.5974999999999,4498.317,null,null,null,null,null,null,null,null,null,null,"Bracknell Forest",1303.8599999999999,1521.17,1738.48,1955.79,2390.41,2825.03,3259.65,3911.58]
["Bradford",1541.2874999999999,1798.1745000000001,2055.0499999999997,2311.9369999999999,2825.6994999999997,3339.462,3853.2244999999998,4623.8739999999998,null,null,null,null,null,null,null,null,null,null,"Bradford",1340.25,1563.63,1787,2010.38,2457.13,2903.88,3350.63,4020.76]
["Braintree",1621.0514999999998,1891.2209999999998,2161.3905,2431.5714999999996,2971.922,3512.2725,4052.6229999999996,4863.1429999999991,null,null,null,null,null,null,null,null,null,null,"Braintree",1409.61,1644.54,1879.47,2114.41,2584.2800000000002,3054.15,3524.02,4228.82]
["Breckland",1475.4154999999998,1721.3084999999999,1967.2129999999997,2213.1174999999998,2704.9265,3196.7240000000002,3688.5329999999999,4426.2349999999997,null,null,null,null,null,null,null,null,null,null,"Breckland",1282.97,1496.79,1710.62,1924.45,2352.11,2779.76,3207.42,3848.9]
["Brent",1524.5894999999998,1778.6934999999999,2032.7860000000001,2286.89,2795.0864999999999,3303.2829999999999,3811.4794999999995,4573.78,null,null,null,null,null,null,null,null,null,null,"Brent",1325.73,1546.69,1767.64,1988.6,2430.5100000000002,2872.42,3314.33,3977.2]
["Brentwood",1708.7735,1993.5594999999998,2278.357,2563.1544999999996,3132.7494999999999,3702.3329999999996,4271.9279999999999,5126.3089999999993,null,null,null,null,null,null,null,null,null,null,"Brentwood",1485.89,1733.53,1981.18,2228.83,2724.13,3219.42,3714.72,4457.66]
["Brighton & Hove",1798.0134999999998,2097.6804999999999,2397.3589999999995,2697.0259999999994,3296.3599999999997,3895.7055,4495.0394999999999,5394.0519999999988,null,null,null,null,null,null,null,null,null,null,"Brighton & Hove",1563.49,1824.07,2084.66,2345.2399999999998,2866.4,3387.57,3908.73,4690.4799999999996]
["Bristol",1625.9044999999999,1896.8905,2167.8764999999999,2438.8624999999997,2980.8344999999999,3522.7950000000001,4064.7669999999998,4877.7249999999995,null,null,null,null,null,null,null,null,null,null,"Bristol",1413.83,1649.47,1885.11,2120.75,2592.0300000000002,3063.3,3534.58,4241.5]
["Broadland",1412.3495,1647.7314999999999,1883.1249999999998,2118.5184999999997,2589.3054999999999,3060.0809999999997,3530.8679999999999,4237.0369999999994,null,null,null,null,null,null,null,null,null,null,"Broadland",1228.1300000000001,1432.81,1637.5,1842.19,2251.5700000000002,2660.94,3070.32,3684.38]
["Bromley",1607.8954999999999,1875.8684999999998,2143.8530000000001,2411.8374999999996,2947.8064999999997,3483.7639999999997,4019.7329999999997,4823.6749999999993,null,null,null,null,null,null,null,null,null,null,"Bromley",1398.17,1631.19,1864.22,2097.25,2563.31,3029.36,3495.42,4194.5]
["Bromsgrove",1530.9374999999998,1786.0879999999997,2041.2384999999999,2296.4004999999997,2806.7129999999997,3317.0254999999997,3827.3379999999997,4592.8009999999995,null,null,null,null,null,null,null,null,null,null,"Bromsgrove",1331.25,1553.12,1774.99,1996.87,2440.62,2884.37,3328.12,3993.74]
["Broxbourne",1757.7749999999999,2050.7374999999997,2343.6999999999998,2636.6624999999999,3222.5874999999996,3808.5124999999998,4394.4375,5273.3249999999998,null,null,null,null,null,null,null,null,null,null,"Broxbourne",1528.5,1783.25,2038,2292.75,2802.25,3311.75,3821.25,4585.5]
["Broxtowe",1668.9144999999999,1947.0649999999998,2225.2269999999999,2503.3774999999996,3059.6785,3615.991,4172.2919999999995,5006.7549999999992,null,null,null,null,null,null,null,null,null,null,"Broxtowe",1451.23,1693.1,1934.98,2176.85,2660.59,3144.34,3628.08,4353.7]
["Buckinghamshire",1720.2504999999996,2006.9569999999999,2293.6634999999997,2580.37,3153.7829999999999,3727.1959999999995,4300.6205,5160.74,null,null,null,null,null,null,null,null,null,null,"Buckinghamshire",1495.87,1745.18,1994.49,2243.8000000000002,2742.42,3241.04,3739.67,4487.6000000000004]
["Burnley",1670.9959999999999,1949.4914999999999,2227.9870000000001,2506.4939999999997,3063.4964999999997,3620.4874999999997,4177.49,5012.9879999999994,null,null,null,null,null,null,null,null,null,null,"Burnley",1453.04,1695.21,1937.38,2179.56,2663.91,3148.25,3632.6,4359.12]
["Bury",1599.2014999999997,1865.7370000000001,2132.2725,2398.808,2931.8789999999999,3464.9384999999993,3998.0095000000001,4797.616,null,null,null,null,null,null,null,null,null,null,"Bury",1390.61,1622.38,1854.15,2085.92,2549.46,3012.99,3476.53,4171.84]
["Calderdale",1630.056,1901.732,2173.4079999999999,2445.0839999999998,2988.4359999999997,3531.7879999999996,4075.1399999999994,4890.1679999999997,null,null,null,null,null,null,null,null,null,null,"Calderdale",1417.44,1653.68,1889.92,2126.16,2598.64,3071.12,3543.6,4252.32]
["Cambridge",1457.0155,1699.8495,1942.6949999999997,2185.529,2671.1970000000001,3156.8764999999999,3642.5444999999995,4371.058,null,null,null,null,null,null,null,null,null,null,"Cambridge",1266.97,1478.13,1689.3,1900.46,2322.7800000000002,2745.11,3167.43,3800.92]
["Camden",1595.7514999999999,1861.712,2127.6725000000001,2393.6329999999998,2925.5539999999996,3457.4634999999994,3989.3845000000001,4787.2659999999996,null,null,null,null,null,null,null,null,null,null,"Camden",1387.61,1618.88,1850.15,2081.42,2543.96,3006.49,3469.03,4162.84]
["Cannock Chase",1621.2354999999998,1891.4395,2161.6434999999997,2431.8474999999999,2972.2554999999998,3512.6634999999997,4053.0829999999996,4863.6949999999997,null,null,null,null,null,null,null,null,null,null,"Cannock Chase",1409.77,1644.73,1879.69,2114.65,2584.5700000000002,3054.49,3524.42,4229.3]
["Canterbury",1575.0975000000001,1837.6195,2100.13,2362.652,2887.6844999999998,3412.7169999999996,3937.7494999999999,4725.3040000000001,null,null,null,null,null,null,null,null,null,null,"Canterbury",1369.65,1597.93,1826.2,2054.48,2511.0300000000002,2967.58,3424.13,4108.96]
["Carlisle",1663.4864999999998,1940.7284999999997,2217.9704999999999,2495.2240000000002,3049.7194999999997,3604.2149999999997,4158.7104999999992,4990.4480000000003,null,null,null,null,null,null,null,null,null,null,"Carlisle",1446.51,1687.59,1928.67,2169.7600000000002,2651.93,3134.1,3616.27,4339.5200000000004]
["Castle Point",1624.329,1895.0504999999998,2165.7719999999999,2436.4935,2977.9364999999998,3519.3794999999996,4060.8224999999998,4872.9870000000001,null,null,null,null,null,null,null,null,null,null,"Castle Point",1412.46,1647.87,1883.28,2118.69,2589.5100000000002,3060.33,3531.15,4237.38]
["Central Bedfordshire",1552.3734999999999,1811.1004999999998,2069.8389999999999,2328.5659999999998,2846.02,3363.4854999999998,3880.9394999999995,4657.1319999999996,null,null,null,null,null,null,null,null,null,null,"Central Bedfordshire",1349.89,1574.87,1799.86,2024.84,2474.8000000000002,2924.77,3374.73,4049.68]
["Charnwood",1578.8924999999999,1842.0469999999998,2105.1899999999996,2368.3444999999997,2894.6419999999998,3420.9395,3947.2369999999996,4736.6889999999994,null,null,null,null,null,null,null,null,null,null,"Charnwood",1372.95,1601.78,1830.6,2059.4299999999998,2517.08,2974.73,3432.38,4118.8599999999997]
["Chelmsford",1719.3649999999998,2005.9219999999998,2292.4789999999998,2579.0475000000001,3152.1729999999998,3725.2869999999998,4298.4124999999995,5158.0950000000003,null,null,null,null,null,null,null,null,null,null,"Chelmsford",1495.1,1744.28,1993.46,2242.65,2741.02,3239.38,3737.75,4485.3]
["Cheltenham",1616.9114999999999,1886.4024999999997,2155.8820000000001,2425.3729999999996,2964.3434999999999,3503.3139999999999,4042.2844999999998,4850.7459999999992,null,null,null,null,null,null,null,null,null,null,"Cheltenham",1406.01,1640.35,1874.68,2109.02,2577.69,3046.36,3515.03,4218.04]
["Cherwell",1663.2449999999999,1940.4524999999996,2217.66,2494.8674999999994,3049.2824999999998,3603.6974999999998,4158.1124999999993,4989.7349999999988,null,null,null,null,null,null,null,null,null,null,"Cherwell",1446.3,1687.35,1928.4,2169.4499999999998,2651.55,3133.65,3615.75,4338.8999999999996]
["Cheshire East",1559.4459999999999,1819.3574999999998,2079.2574999999997,2339.1689999999999,2858.9805000000001,3378.8035,3898.6149999999998,4678.3379999999997,null,null,null,null,null,null,null,null,null,null,"Cheshire East",1356.04,1582.05,1808.05,2034.06,2486.0700000000002,2938.09,3390.1,4068.12]
["Cheshire West and Chester",1633.2184999999999,1905.412,2177.6169999999997,2449.8220000000001,2994.2319999999995,3538.6304999999998,4083.0404999999996,4899.6440000000002,null,null,null,null,null,null,null,null,null,null,"Cheshire West and Chester",1420.19,1656.88,1893.58,2130.2800000000002,2603.6799999999998,3077.07,3550.47,4260.5600000000004]
["Chesterfield",1635.3919999999998,1907.9534999999998,2180.5149999999999,2453.0879999999997,2998.2224999999999,3543.3454999999999,4088.4799999999996,4906.1759999999995,null,null,null,null,null,null,null,null,null,null,"Chesterfield",1422.08,1659.09,1896.1,2133.12,2607.15,3081.17,3555.2,4266.24]
["Chichester",878.32399999999996,1024.7075,1171.1025,1317.4860000000001,1610.2645,1903.0314999999998,2195.81,2634.9720000000002,null,null,null,null,null,null,null,null,null,null,"Chichester",763.76,891.05,1018.35,1145.6400000000001,1400.23,1654.81,1909.4,2291.2800000000002]
["Chorley",1542.0809999999999,1799.0944999999999,2056.1079999999997,2313.1214999999997,2827.1484999999998,3341.1754999999998,3855.2024999999994,4626.2429999999995,null,null,null,null,null,null,null,null,null,null,"Chorley",1340.94,1564.43,1787.92,2011.41,2458.39,2905.37,3352.35,4022.82]
["City of London",1703.0694999999998,1986.9124999999999,2270.7554999999998,2554.5984999999996,3122.2845000000002,3689.9704999999999,4257.6679999999997,5109.1969999999992,null,null,null,null,null,null,null,null,null,null,"City of London",1480.93,1727.75,1974.57,2221.39,2715.03,3208.67,3702.32,4442.78]
["Colchester",1582.1125,1845.7959999999998,2109.4909999999995,2373.1745000000001,2900.5414999999998,3427.92,3955.2869999999998,4746.3490000000002,null,null,null,null,null,null,null,null,null,null,"Colchester",1375.75,1605.04,1834.34,2063.63,2522.21,2980.8,3439.38,4127.26]
["Copeland",1675.9294999999997,1955.2414999999999,2234.5649999999996,2513.8884999999996,3072.5355,3631.1709999999998,4189.8180000000002,5027.7769999999991,null,null,null,null,null,null,null,null,null,null,"Copeland",1457.33,1700.21,1943.1,2185.9899999999998,2671.77,3157.54,3643.32,4371.9799999999996]
["Cornwall",1608.9764999999998,1877.1334999999999,2145.2905000000001,2413.4589999999998,2949.7845000000002,3486.1099999999997,4022.4354999999996,4826.9179999999997,null,null,null,null,null,null,null,null,null,null,"Cornwall",1399.11,1632.29,1865.47,2098.66,2565.0300000000002,3031.4,3497.77,4197.32]
["Cotswold",1716.9959999999999,2003.162,2289.328,2575.4939999999997,3147.8259999999996,3720.1579999999999,4292.49,5150.9879999999994,null,null,null,null,null,null,null,null,null,null,"Cotswold",1493.04,1741.88,1990.72,2239.56,2737.24,3234.92,3732.6,4479.12]
["Coventry",1599.9144999999999,1866.5649999999998,2133.2269999999999,2399.8774999999996,2933.1785,3466.491,3999.7919999999995,4799.7549999999992,null,null,null,null,null,null,null,null,null,null,"Coventry",1391.23,1623.1,1854.98,2086.85,2550.59,3014.34,3478.08,4173.7]
["Craven",1650.6064999999999,1925.6979999999999,2200.8009999999999,2475.904,3026.1099999999997,3576.3044999999997,4126.5104999999994,4951.808,null,null,null,null,null,null,null,null,null,null,"Craven",1435.31,1674.52,1913.74,2152.96,2631.4,3109.83,3588.27,4305.92]
["Crawley",1593.1179999999997,1858.6415,2124.1534999999999,2389.6769999999997,2920.7124999999996,3451.7595000000001,3982.7950000000001,4779.3539999999994,null,null,null,null,null,null,null,null,null,null,"Crawley",1385.32,1616.21,1847.09,2077.98,2539.75,3001.53,3463.3,4155.96]
["Croydon",{"$f":"U68*115%","v":1540.3215},{"$f":"V68*115%","v":1797.0360000000001},{"$f":"W68*115%","v":2053.7504999999996},{"$f":"X68*115%","v":2310.4764999999998},{"$f":"Y68*115%","v":2823.9169999999999},{"$f":"Z68*115%","v":3337.3575000000001},{"$f":"AA68*115%","v":3850.7979999999998},{"$f":"AB68*115%","v":4620.9529999999995},null,null,null,null,null,null,null,null,null,null,"Croydon",1339.41,1562.64,1785.87,2009.11,2455.58,2902.05,3348.52,4018.22]
["Dacorum",1628.9404999999999,1900.4324999999999,2171.9245000000001,2443.4164999999998,2986.4004999999997,3529.3729999999996,4072.3569999999995,4886.8329999999996,null,null,null,null,null,null,null,null,null,null,"Dacorum",1416.47,1652.55,1888.63,2124.71,2596.87,3069.02,3541.18,4249.42]
["Darlington",1476.5654999999999,1722.654,1968.7424999999998,2214.8424999999997,2707.0309999999999,3199.2194999999997,3691.4079999999999,4429.6849999999995,null,null,null,null,null,null,null,null,null,null,"Darlington",1283.97,1497.96,1711.95,1925.95,2353.94,2781.93,3209.92,3851.9]
["Dartford",1830.6504999999997,2135.7570000000001,2440.875,2745.9814999999999,3356.1944999999996,3966.4189999999994,4576.6319999999996,5491.9629999999997,null,null,null,null,null,null,null,null,null,null,"Dartford",1591.87,1857.18,2122.5,2387.81,2918.43,3449.06,3979.68,4775.62]
["Derbyshire Dales",1649.0309999999999,1923.8695,2198.7080000000001,2473.5464999999995,3023.2234999999996,3572.9004999999997,4122.5774999999994,4947.0929999999989,null,null,null,null,null,null,null,null,null,null,"Derbyshire Dales",1433.94,1672.93,1911.92,2150.91,2628.89,3106.87,3584.85,4301.82]
["Doncaster",1413.7064999999998,1649.33,1884.9419999999998,2120.5654999999997,2591.8009999999995,3063.0365000000002,3534.2719999999999,4241.1309999999994,null,null,null,null,null,null,null,null,null,null,"Doncaster",1229.31,1434.2,1639.08,1843.97,2253.7399999999998,2663.51,3073.28,3687.94]
["Dover",1775.7034999999998,2071.6444999999999,2367.5970000000002,2663.5495000000001,3255.4544999999998,3847.3479999999995,4439.2529999999997,5327.0990000000002,null,null,null,null,null,null,null,null,null,null,"Dover",1544.09,1801.43,2058.7800000000002,2316.13,2830.83,3345.52,3860.22,4632.26]
["Dudley",1411.3489999999999,1646.5699999999997,1881.8024999999998,2117.0234999999998,2587.4769999999999,3057.9189999999999,3528.3724999999999,4234.0469999999996,null,null,null,null,null,null,null,null,null,null,"Dudley",1227.26,1431.8,1636.35,1840.89,2249.98,2659.06,3068.15,3681.78]
["Durham",1643.212,1917.0729999999999,2190.9454999999998,2464.8180000000002,3012.5515,3560.2964999999995,4108.03,4929.6360000000004,null,null,null,null,null,null,null,null,null,null,"Durham",1428.88,1667.02,1905.17,2143.3200000000002,2619.61,3095.91,3572.2,4286.6400000000003]
["Ealing",1714.0404999999998,1999.712,2285.395,2571.0664999999999,3142.4095000000002,3713.7639999999997,4285.1069999999991,5142.1329999999998,null,null,null,null,null,null,null,null,null,null,"Ealing",1490.47,1738.88,1987.3,2235.71,2732.53,3229.36,3726.18,4471.42]
["East Cambridgeshire",1554.9955,1814.1594999999998,2073.3235,2332.4874999999997,2850.8154999999997,3369.1434999999997,3887.4829999999997,4664.9749999999995,null,null,null,null,null,null,null,null,null,null,"East Cambridgeshire",1352.17,1577.53,1802.89,2028.25,2478.9699999999998,2929.69,3380.42,4056.5]
["East Devon",1623.0064999999997,1893.4979999999998,2164.0009999999997,2434.5039999999999,2975.5099999999998,3516.5044999999996,4057.5104999999999,4869.0079999999998,null,null,null,null,null,null,null,null,null,null,"East Devon",1411.31,1646.52,1881.74,2116.96,2587.4,3057.83,3528.27,4233.92]
["East Hampshire",1556.8584999999998,1816.3329999999999,2075.8074999999999,2335.2819999999997,2854.2309999999998,3373.1799999999994,3892.1404999999995,4670.5639999999994,null,null,null,null,null,null,null,null,null,null,"East Hampshire",1353.79,1579.42,1805.05,2030.68,2481.94,2933.2,3384.47,4061.36]
["East Hertfordshire",1628.3999999999999,1899.8,2171.1999999999998,2442.6,2985.3999999999996,3528.2,4070.9999999999995,4885.2,null,null,null,null,null,null,null,null,null,null,"East Hertfordshire",1416,1652,1888,2124,2596,3068,3540,4248]
["East Lindsey",1574.7754999999997,1837.2284999999997,2099.6929999999998,2362.1574999999998,2887.0864999999999,3412.0039999999999,3936.933,4724.3149999999996,null,null,null,null,null,null,null,null,null,null,"East Lindsey",1369.37,1597.59,1825.82,2054.0500000000002,2510.5100000000002,2966.96,3423.42,4108.1000000000004]
["East Riding of Yorkshire",1547.7044999999998,1805.6610000000001,2063.6059999999998,2321.5625,2837.4639999999999,3353.3654999999994,3869.2669999999998,4643.125,null,null,null,null,null,null,null,null,null,null,"East Riding of Yorkshire",1345.83,1570.14,1794.44,2018.75,2467.36,2915.97,3364.58,4037.5]
["East Staffordshire",1769.2864999999999,2064.1579999999999,2359.0410000000002,2653.924,3243.6899999999996,3833.4444999999996,4423.2104999999992,5307.848,null,null,null,null,null,null,null,null,null,null,"East Staffordshire",1538.51,1794.92,2051.34,2307.7600000000002,2820.6,3333.43,3846.27,4615.5200000000004]
["East Suffolk",1550.7634999999998,1809.2259999999999,2067.6884999999997,2326.1509999999998,2843.0759999999996,3359.9894999999997,3876.9144999999999,4652.3019999999997,null,null,null,null,null,null,null,null,null,null,"East Suffolk",1348.49,1573.24,1797.99,2022.74,2472.2399999999998,2921.73,3371.23,4045.48]
["Eastbourne",1709.4864999999998,1994.3989999999999,2279.3114999999998,2564.2240000000002,3134.049,3703.8739999999998,4273.7104999999992,5128.4480000000003,null,null,null,null,null,null,null,null,null,null,"Eastbourne",1486.51,1734.26,1982.01,2229.7600000000002,2725.26,3220.76,3716.27,4459.5200000000004]
["Eastleigh",1496.8744999999999,1746.3439999999998,1995.8249999999998,2245.306,2744.268,3243.2184999999999,3742.1804999999999,4490.6120000000001,null,null,null,null,null,null,null,null,null,null,"Eastleigh",1301.6300000000001,1518.56,1735.5,1952.44,2386.3200000000002,2820.19,3254.07,3904.88]
["Eden",1535.0544999999997,1790.8949999999998,2046.7469999999998,2302.5874999999996,2814.2684999999997,3325.9609999999998,3837.6419999999998,4605.1749999999993,null,null,null,null,null,null,null,null,null,null,"Eden",1334.83,1557.3,1779.78,2002.25,2447.19,2892.14,3337.08,4004.5]
["Elmbridge",1690.6955,1972.4684999999999,2254.2529999999997,2536.0374999999999,3099.6064999999999,3663.1639999999998,4226.7330000000002,5072.0749999999998,null,null,null,null,null,null,null,null,null,null,"Elmbridge",1470.17,1715.19,1960.22,2205.25,2695.31,3185.36,3675.42,4410.5]
["Enfield",1574.8905,1837.3664999999999,2099.8424999999997,2362.3299999999995,2887.2934999999998,3412.2569999999996,3937.2204999999999,4724.6599999999989,null,null,null,null,null,null,null,null,null,null,"Enfield",1369.47,1597.71,1825.95,2054.1999999999998,2510.69,2967.18,3423.67,4108.3999999999996]
["Epping Forest",1661.8304999999998,1938.808,2215.7739999999999,2492.7514999999999,3046.6950000000002,3600.6384999999996,4154.5819999999994,4985.5029999999997,null,null,null,null,null,null,null,null,null,null,"Epping Forest",1445.07,1685.92,1926.76,2167.61,2649.3,3130.99,3612.68,4335.22]
["Epsom & Ewell",1512.3304999999998,1764.376,2016.433,2268.4899999999998,2772.6039999999998,3276.7064999999998,3780.8204999999998,4536.9799999999996,null,null,null,null,null,null,null,null,null,null,"Epsom & Ewell",1315.07,1534.24,1753.42,1972.6,2410.96,2849.31,3287.67,3945.2]
["Erewash",1697.1814999999999,1980.0469999999998,2262.9124999999999,2545.7779999999998,3111.5089999999996,3677.2284999999997,4242.9594999999999,5091.5559999999996,null,null,null,null,null,null,null,null,null,null,"Erewash",1475.81,1721.78,1967.75,2213.7199999999998,2705.66,3197.59,3689.53,4427.4399999999996]
["Exeter",1703.6215,1987.5564999999997,2271.5029999999997,2555.4379999999996,3123.308,3691.1895,4259.0595000000003,5110.8759999999993,null,null,null,null,null,null,null,null,null,null,"Exeter",1481.41,1728.31,1975.22,2222.12,2715.92,3209.73,3703.53,4444.24]
["Fareham",1622.5925,1893.0264999999997,2163.4604999999997,2433.8944999999994,2974.7624999999998,3515.6189999999997,4056.4869999999996,4867.7889999999989,null,null,null,null,null,null,null,null,null,null,"Fareham",1410.95,1646.11,1881.27,2116.4299999999998,2586.75,3057.06,3527.38,4232.8599999999997]
["Fenland",1659.8064999999999,1936.4389999999996,2213.0830000000001,2489.7154999999998,3042.9805000000001,3596.2569999999996,4149.5219999999999,4979.4309999999996,null,null,null,null,null,null,null,null,null,null,"Fenland",1443.31,1683.86,1924.42,2164.9699999999998,2646.07,3127.18,3608.28,4329.9399999999996]
["Folkestone & Hythe",1787.836,2085.8009999999999,2383.7774999999997,2681.7539999999999,3277.6954999999998,3873.6484999999993,4469.5899999999992,5363.5079999999998,null,null,null,null,null,null,null,null,null,null,"Folkestone & Hythe",1554.64,1813.74,2072.85,2331.96,2850.17,3368.39,3886.6,4663.92]
["Forest of Dean",1754.0949999999998,2046.4364999999998,2338.7894999999999,2631.1424999999995,3215.837,3800.5430000000001,4385.2374999999993,5262.2849999999989,null,null,null,null,null,null,null,null,null,null,"Forest of Dean",1525.3,1779.51,2033.73,2287.9499999999998,2796.38,3304.82,3813.25,4575.8999999999996]
["Fylde",1571.107,1832.962,2094.8054999999999,2356.6605,2880.3589999999995,3404.0689999999995,3927.7674999999995,4713.3209999999999,null,null,null,null,null,null,null,null,null,null,"Fylde",1366.18,1593.88,1821.57,2049.27,2504.66,2960.06,3415.45,4098.54]
["Gateshead",1564.0689999999997,1824.751,2085.4214999999999,2346.1034999999997,2867.4559999999997,3388.82,3910.1724999999997,4692.2069999999994,null,null,null,null,null,null,null,null,null,null,"Gateshead",1360.06,1586.74,1813.41,2040.09,2493.44,2946.8,3400.15,4080.18]
["Gedling",1612.8864999999998,1881.6989999999998,2150.5114999999996,2419.3240000000001,2956.9490000000001,3494.5740000000001,4032.2104999999997,4838.6480000000001,null,null,null,null,null,null,null,null,null,null,"Gedling",1402.51,1636.26,1870.01,2103.7600000000002,2571.2600000000002,3038.76,3506.27,4207.5200000000004]
["Gloucester",1609.6664999999998,1877.9385,2146.2104999999997,2414.4939999999997,2951.0495000000001,3487.6049999999996,4024.1604999999995,4828.9879999999994,null,null,null,null,null,null,null,null,null,null,"Gloucester",1399.71,1632.99,1866.27,2099.56,2566.13,3032.7,3499.27,4199.12]
["Gosport",1391.0399999999997,1622.8799999999999,1854.7199999999998,2086.56,2550.2399999999998,3013.92,3477.6,4173.12,null,null,null,null,null,null,null,null,null,null,"Gosport",1209.5999999999999,1411.2,1612.8,1814.4,2217.6,2620.8000000000002,3024,3628.8]
["Gravesham",1697.9864999999998,1980.9899999999998,2263.982,2546.9854999999998,3112.9809999999998,3678.9764999999998,4244.9719999999998,5093.9709999999995,null,null,null,null,null,null,null,null,null,null,"Gravesham",1476.51,1722.6,1968.68,2214.77,2706.94,3199.11,3691.28,4429.54]
["Great Yarmouth",1359.5184999999999,1586.1029999999998,1812.6989999999998,2039.2834999999998,2492.4524999999999,2945.6329999999998,3398.8019999999997,4078.5669999999996,null,null,null,null,null,null,null,null,null,null,"Great Yarmouth",1182.19,1379.22,1576.26,1773.29,2167.35,2561.42,2955.48,3546.58]
["Greenwich",1561.5504999999998,1821.807,2082.0634999999997,2342.3199999999997,2862.8330000000001,3383.3459999999995,3903.8705,4684.6399999999994,null,null,null,null,null,null,null,null,null,null,"Greenwich",1357.87,1584.18,1810.49,2036.8,2489.42,2942.04,3394.67,4073.6]
["Guildford",1001.2704999999999,1168.1469999999999,1335.0235,1501.8999999999999,1835.6529999999998,2169.4059999999999,2503.1704999999997,3003.7999999999997,null,null,null,null,null,null,null,null,null,null,"Guildford",870.67,1015.78,1160.8900000000001,1306,1596.22,1886.44,2176.67,2612]
["Hackney",1623.0409999999997,1893.5439999999999,2164.047,2434.5615000000003,2975.5789999999997,3516.585,4057.6024999999995,4869.1230000000005,null,null,null,null,null,null,null,null,null,null,"Hackney",1411.34,1646.56,1881.78,2117.0100000000002,2587.46,3057.9,3528.35,4234.0200000000004]
["Halton",1527.4414999999999,1782.0169999999998,2036.5925,2291.1679999999997,2800.3189999999995,3309.4584999999997,3818.6095,4582.3359999999993,null,null,null,null,null,null,null,null,null,null,"Halton",1328.21,1549.58,1770.95,1992.32,2435.06,2877.79,3320.53,3984.64]
["Hambleton",1573.8209999999999,1836.1244999999999,2098.4279999999999,2360.7314999999999,2885.3384999999994,3409.9454999999998,3934.5524999999998,4721.4629999999997,null,null,null,null,null,null,null,null,null,null,"Hambleton",1368.54,1596.63,1824.72,2052.81,2508.9899999999998,2965.17,3421.35,4105.62]
["Hammersmith & Fulham",1658.1504999999997,1934.5069999999998,2210.8634999999999,2487.2199999999998,3039.933,3592.6459999999997,4145.3705,4974.4399999999996,null,null,null,null,null,null,null,null,null,null,"Hammersmith & Fulham",1441.87,1682.18,1922.49,2162.8000000000002,2643.42,3124.04,3604.67,4325.6000000000004]
["Harborough",1593.5204999999999,1859.1129999999998,2124.694,2390.2865000000002,2921.46,3452.6334999999999,3983.8069999999993,4780.5730000000003,null,null,null,null,null,null,null,null,null,null,"Harborough",1385.67,1616.62,1847.56,2078.5100000000002,2540.4,3002.29,3464.18,4157.0200000000004]
["Haringey",1768.7114999999999,2063.4909999999995,2358.2705000000001,2653.0615000000003,3242.6319999999996,3832.2024999999994,4421.7729999999992,5306.1230000000005,null,null,null,null,null,null,null,null,null,null,"Haringey",1538.01,1794.34,2050.67,2307.0100000000002,2819.68,3332.35,3845.02,4614.0200000000004]
["Harlow",1784.9264999999998,2082.4199999999996,2379.902,2677.3955000000001,3272.3709999999996,3867.3464999999997,4462.3220000000001,5354.7910000000002,null,null,null,null,null,null,null,null,null,null,"Harlow",1552.11,1810.8,2069.48,2328.17,2845.54,3362.91,3880.28,4656.34]
["Harrogate",1547.2904999999998,1805.1664999999998,2063.0425,2320.9299999999998,2836.6934999999999,3352.4569999999994,3868.2204999999999,4641.8599999999997,null,null,null,null,null,null,null,null,null,null,"Harrogate",1345.47,1569.71,1793.95,2018.2,2466.69,2915.18,3363.67,4036.4]
["Harrow",1600.9034999999999,1867.7149999999997,2134.5264999999999,2401.3494999999998,2934.9839999999995,3468.6184999999996,4002.2529999999992,4802.6989999999996,null,null,null,null,null,null,null,null,null,null,"Harrow",1392.09,1624.1,1856.11,2088.13,2552.16,3016.19,3480.22,4176.26]
["Hart",1703.0694999999998,1986.9124999999999,2270.7669999999998,2554.61,3122.2959999999998,3689.9934999999996,4257.6794999999993,5109.22,null,null,null,null,null,null,null,null,null,null,"Hart",1480.93,1727.75,1974.58,2221.4,2715.04,3208.69,3702.33,4442.8]
["Hartlepool",1591.5539999999999,1856.8129999999996,2122.0719999999997,2387.3309999999997,2917.8490000000002,3448.3669999999997,3978.8849999999998,4774.6619999999994,null,null,null,null,null,null,null,null,null,null,"Hartlepool",1383.96,1614.62,1845.28,2075.94,2537.2600000000002,2998.58,3459.9,4151.88]
["Hastings",1584.7114999999999,1848.8205,2112.9409999999998,2377.0615000000003,2905.3024999999998,3433.5319999999997,3961.7729999999997,4754.1230000000005,null,null,null,null,null,null,null,null,null,null,"Hastings",1378.01,1607.67,1837.34,2067.0100000000002,2526.35,2985.68,3445.02,4134.0200000000004]
["Havant",1349.6859999999999,1574.6374999999998,1799.5774999999996,2024.529,2474.4204999999997,2924.3234999999995,3374.2149999999997,4049.058,null,null,null,null,null,null,null,null,null,null,"Havant",1173.6400000000001,1369.25,1564.85,1760.46,2151.67,2542.89,2934.1,3520.92]
["Havering",1602.4904999999999,1869.578,2136.654,2403.7414999999996,2937.9049999999997,3472.0684999999999,4006.2319999999995,4807.4829999999993,null,null,null,null,null,null,null,null,null,null,"Havering",1393.47,1625.72,1857.96,2090.21,2554.6999999999998,3019.19,3483.68,4180.42]
["Herefordshire",1616.7850000000001,1886.2529999999999,2155.7094999999999,2425.1774999999998,2964.1019999999999,3503.0379999999996,4041.9624999999996,4850.3549999999996,null,null,null,null,null,null,null,null,null,null,"Herefordshire",1405.9,1640.22,1874.53,2108.85,2577.48,3046.12,3514.75,4217.7]
["Hertsmere",1442.5024999999998,1682.91,1923.329,2163.7479999999996,2644.5859999999998,3125.4124999999999,3606.2504999999996,4327.4959999999992,null,null,null,null,null,null,null,null,null,null,"Hertsmere",1254.3499999999999,1463.4,1672.46,1881.52,2299.64,2717.75,3135.87,3763.04]
["High Peak",1680.4604999999999,1960.5314999999998,2240.6024999999995,2520.6849999999999,3080.8384999999994,3640.9919999999997,4201.1454999999996,5041.37,null,null,null,null,null,null,null,null,null,null,"High Peak",1461.27,1704.81,1948.35,2191.9,2678.99,3166.08,3653.17,4383.8]
["Hillingdon",1663.4175,1940.6479999999999,2217.8784999999998,2495.1205,3049.5929999999998,3604.0654999999997,4158.5379999999996,4990.241,null,null,null,null,null,null,null,null,null,null,"Hillingdon",1446.45,1687.52,1928.59,2169.67,2651.82,3133.97,3616.12,4339.34]
["Hinckley & Bosworth",1651.9175,1927.2389999999998,2202.5604999999996,2477.8819999999996,3028.5249999999996,3579.1564999999996,4129.7995000000001,4955.7639999999992,null,null,null,null,null,null,null,null,null,null,"Hinckley & Bosworth",1436.45,1675.86,1915.27,2154.6799999999998,2633.5,3112.31,3591.13,4309.3599999999997]
["Horsham",1731.4399999999998,2020.0094999999999,2308.5789999999997,2597.16,3174.3104999999996,3751.4494999999997,4328.5999999999995,5194.32,null,null,null,null,null,null,null,null,null,null,"Horsham",1505.6,1756.53,2007.46,2258.4,2760.27,3262.13,3764,4516.8]
["Hounslow",1356.3674999999998,1582.4344999999998,1808.4899999999998,2034.557,2486.6794999999997,2938.8019999999997,3390.9245000000001,4069.114,null,null,null,null,null,null,null,null,null,null,"Hounslow",1179.45,1376.03,1572.6,1769.18,2162.33,2555.48,2948.63,3538.36]
["Huntingdonshire",1391.2354999999998,1623.11,1854.9844999999998,2086.8589999999999,2550.6079999999997,3014.3454999999999,3478.0944999999997,4173.7179999999998,null,null,null,null,null,null,null,null,null,null,"Huntingdonshire",1209.77,1411.4,1613.03,1814.66,2217.92,2621.17,3024.43,3629.32]
["Hyndburn",1105.7594999999999,1290.0469999999998,1474.3344999999999,1658.6334999999999,2027.2199999999998,2395.8064999999997,2764.393,3317.2669999999998,null,null,null,null,null,null,null,null,null,null,"Hyndburn",961.53,1121.78,1282.03,1442.29,1762.8,2083.31,2403.8200000000002,2884.58]
["Ipswich",1620.7179999999998,1890.8415,2160.9534999999996,2431.0769999999998,2971.3124999999995,3511.5594999999998,4051.7950000000001,4862.1539999999995,null,null,null,null,null,null,null,null,null,null,"Ipswich",1409.32,1644.21,1879.09,2113.98,2583.75,3053.53,3523.3,4227.96]
["Isles of Scilly",{"$f":"U132*115%","v":1611.8744999999999},{"$f":"V132*115%","v":1880.5259999999998},{"$f":"W132*115%","v":2149.1659999999997},{"$f":"X132*115%","v":2417.8174999999997},{"$f":"Y132*115%","v":2955.1089999999995},{"$f":"Z132*115%","v":3492.4004999999997},{"$f":"AA132*115%","v":4029.6919999999996},{"$f":"AB132*115%","v":4835.6349999999993},null,null,null,null,null,null,null,null,null,null,"Isles of Scilly",1401.63,1635.24,1868.84,2102.4499999999998,2569.66,3036.87,3504.08,4204.8999999999996]
["Islington",1648.6284999999998,1923.3979999999999,2198.1675,2472.9369999999999,3022.4759999999997,3572.0149999999994,4121.5654999999997,4945.8739999999998,null,null,null,null,null,null,null,null,null,null,"Islington",1433.59,1672.52,1911.45,2150.38,2628.24,3106.1,3583.97,4300.76]
["Kensington & Chelsea",1350.7899999999997,1575.9254999999998,1801.0495000000001,2026.1849999999999,2476.4444999999996,2926.7154999999993,3376.9749999999999,4052.37,null,null,null,null,null,null,null,null,null,null,"Kensington & Chelsea",1174.5999999999999,1370.37,1566.13,1761.9,2153.4299999999998,2544.9699999999998,2936.5,3523.8]
["King's Lynn & West Norfolk",1690.431,1972.1695,2253.9079999999999,2535.6464999999998,3099.1234999999997,3662.6004999999996,4226.0774999999994,5071.2929999999997,null,null,null,null,null,null,null,null,null,null,"King's Lynn & West Norfolk",1469.94,1714.93,1959.92,2204.91,2694.89,3184.87,3674.85,4409.82]
["Kirklees",1509.0874999999999,1760.6039999999998,2012.1205,2263.6370000000002,2766.67,3269.6914999999999,3772.7244999999998,4527.2740000000003,null,null,null,null,null,null,null,null,null,null,"Kirklees",1312.25,1530.96,1749.67,1968.38,2405.8000000000002,2843.21,3280.63,3936.76]
["Knowsley",1675.5614999999998,1954.8274999999996,2234.0819999999999,2513.348,3071.8685,3630.3889999999997,4188.9094999999998,5026.6959999999999,null,null,null,null,null,null,null,null,null,null,"Knowsley",1457.01,1699.85,1942.68,2185.52,2671.19,3156.86,3642.53,4371.04]
["Lambeth",1830.9264999999998,2136.0789999999997,2441.2429999999999,2746.3955000000001,3356.7004999999995,3967.0169999999998,4577.3220000000001,5492.7910000000002,null,null,null,null,null,null,null,null,null,null,"Lambeth",1592.11,1857.46,2122.8200000000002,2388.17,2918.87,3449.58,3980.28,4776.34]
["Lancaster",1476.807,1722.9414999999999,1969.0759999999998,2215.2104999999997,2707.4794999999999,3199.7484999999997,3692.0174999999995,4430.4209999999994,null,null,null,null,null,null,null,null,null,null,"Lancaster",1284.18,1498.21,1712.24,1926.27,2354.33,2782.39,3210.45,3852.54]
["Leeds",1577.6159999999998,1840.5519999999999,2103.4879999999998,2366.424,2892.2959999999998,3418.1680000000001,3944.0399999999995,4732.848,null,null,null,null,null,null,null,null,null,null,"Leeds",1371.84,1600.48,1829.12,2057.7600000000002,2515.04,2972.32,3429.6,4115.5200000000004]
["Lewes",1605.4919999999997,1873.0739999999998,2140.6559999999999,2408.2379999999998,2943.4019999999996,3478.5659999999998,4013.7299999999996,4816.4759999999997,null,null,null,null,null,null,null,null,null,null,"Lewes",1396.08,1628.76,1861.44,2094.12,2559.48,3024.84,3490.2,4188.24]
["Lewisham",1769.1254999999996,2063.9739999999997,2358.8224999999998,2653.6824999999999,3243.3910000000001,3833.0994999999998,4422.808,5307.3649999999998,null,null,null,null,null,null,null,null,null,null,"Lewisham",1538.37,1794.76,2051.15,2307.5500000000002,2820.34,3333.13,3845.92,4615.1000000000004]
["Lichfield",1615.0944999999999,1884.2749999999999,2153.4554999999996,2422.6359999999995,2960.9969999999998,3499.3579999999997,4037.7304999999997,4845.271999999999,null,null,null,null,null,null,null,null,null,null,"Lichfield",1404.43,1638.5,1872.57,2106.64,2574.7800000000002,3042.92,3511.07,4213.28]
["Lincoln",1678.7124999999999,1958.4959999999999,2238.2794999999996,2518.0629999999996,3077.6299999999997,3637.1970000000001,4196.7754999999997,5036.1259999999993,null,null,null,null,null,null,null,null,null,null,"Lincoln",1459.75,1703.04,1946.33,2189.62,2676.2,3162.78,3649.37,4379.24]
["Liverpool",1568.9909999999998,1830.4894999999999,2091.9879999999998,2353.4865,2876.4834999999998,3399.4805000000001,3922.4774999999995,4706.973,null,null,null,null,null,null,null,null,null,null,"Liverpool",1364.34,1591.73,1819.12,2046.51,2501.29,2956.07,3410.85,4093.02]
["Luton",1596.0274999999997,1862.0225,2128.029,2394.0355,2926.0484999999994,3458.0499999999997,3990.0629999999996,4788.0709999999999,null,null,null,null,null,null,null,null,null,null,"Luton",1387.85,1619.15,1850.46,2081.77,2544.39,3007,3469.62,4163.54]
["Maidstone",1509.9499999999998,1761.6044999999997,2013.259,2264.9249999999997,2768.2455,3271.5544999999997,3774.8749999999995,4529.8499999999995,null,null,null,null,null,null,null,null,null,null,"Maidstone",1313,1531.83,1750.66,1969.5,2407.17,2844.83,3282.5,3939]
["Maldon",1748.4485,2039.8584999999998,2331.2684999999997,2622.6785,3205.4984999999997,3788.3069999999993,4371.1269999999995,5245.357,null,null,null,null,null,null,null,null,null,null,"Maldon",1520.39,1773.79,2027.19,2280.59,2787.39,3294.18,3800.98,4561.18]
["Malvern Hills",1539.8959999999997,1796.5414999999998,2053.1869999999999,2309.8439999999996,2823.1464999999998,3336.4374999999995,3849.74,4619.6879999999992,null,null,null,null,null,null,null,null,null,null,"Malvern Hills",1339.04,1562.21,1785.38,2008.56,2454.91,2901.25,3347.6,4017.12]
["Manchester",1640.9004999999997,1914.3819999999998,2187.875,2461.3564999999999,3008.3194999999996,3555.2939999999999,4102.2569999999996,4922.7129999999997,null,null,null,null,null,null,null,null,null,null,"Manchester",1426.87,1664.68,1902.5,2140.31,2615.9299999999998,3091.56,3567.18,4280.62]
["Mansfield",1448.4364999999998,1689.8444999999999,1931.2524999999998,2172.6605,2655.4764999999998,3138.2809999999999,3621.0969999999998,4345.3209999999999,null,null,null,null,null,null,null,null,null,null,"Mansfield",1259.51,1469.43,1679.35,1889.27,2309.11,2728.94,3148.78,3778.54]
["Medway",1759.7414999999999,2053.0374999999999,2346.3219999999997,2639.6179999999999,3226.1984999999995,3812.7789999999995,4399.3594999999996,5279.2359999999999,null,null,null,null,null,null,null,null,null,null,"Medway",1530.21,1785.25,2040.28,2295.3200000000002,2805.39,3315.46,3825.53,4590.6400000000003]
["Melton",1546.1174999999998,1803.8094999999998,2061.4899999999998,2319.1819999999998,2834.5544999999997,3349.9269999999997,3865.2994999999996,4638.3639999999996,null,null,null,null,null,null,null,null,null,null,"Melton",1344.45,1568.53,1792.6,2016.68,2464.83,2912.98,3361.13,4033.36]
["Mendip",1639.7504999999996,1913.0364999999999,2186.3224999999998,2459.62,3006.2035000000001,3552.7869999999998,4099.3705,4919.24,null,null,null,null,null,null,null,null,null,null,"Mendip",1425.87,1663.51,1901.15,2138.8000000000002,2614.09,3089.38,3564.67,4277.6000000000004]
["Merton",1732.981,2021.8034999999998,2310.6374999999998,2599.4714999999997,3177.1279999999997,3754.7959999999998,4332.4524999999994,5198.9429999999993,null,null,null,null,null,null,null,null,null,null,"Merton",1506.94,1758.09,2009.25,2260.41,2762.72,3265.04,3767.35,4520.82]
["Mid Devon",1568.6919999999998,1830.1444999999999,2091.5854999999997,2353.0379999999996,2875.9314999999997,3398.8364999999999,3921.7299999999996,4706.0759999999991,null,null,null,null,null,null,null,null,null,null,"Mid Devon",1364.08,1591.43,1818.77,2046.12,2500.81,2955.51,3410.2,4092.24]
["Mid Suffolk",1682.3464999999999,1962.7394999999999,2243.1324999999997,2523.5254999999997,3084.3114999999998,3645.0859999999998,4205.8720000000003,5047.0509999999995,null,null,null,null,null,null,null,null,null,null,"Mid Suffolk",1462.91,1706.73,1950.55,2194.37,2682.01,3169.64,3657.28,4388.74]
["Mid Sussex",1602.7665,1869.8884999999998,2137.0104999999999,2404.1439999999998,2938.3995,3472.6549999999997,4006.9104999999995,4808.2879999999996,null,null,null,null,null,null,null,null,null,null,"Mid Sussex",1393.71,1625.99,1858.27,2090.56,2555.13,3019.7,3484.27,4181.12]
["Middlesbrough",1807.087,2108.2604999999999,2409.4454999999998,2710.6304999999998,3312.989,3915.3589999999995,4517.7174999999997,5421.2609999999995,null,null,null,null,null,null,null,null,null,null,"Middlesbrough",1571.38,1833.27,2095.17,2357.0700000000002,2880.86,3404.66,3928.45,4714.1400000000003]
["Milton Keynes",1247.7729999999999,1455.7389999999998,1663.6934999999999,1871.6594999999998,2287.58,2703.5119999999997,3119.4324999999999,3743.3189999999995,null,null,null,null,null,null,null,null,null,null,"Milton Keynes",1085.02,1265.8599999999999,1446.69,1627.53,1989.2,2350.88,2712.55,3255.06]
["Mole Valley",1747.1374999999998,2038.329,2329.5205000000001,2620.712,3203.0949999999998,3785.4664999999995,4367.8494999999994,5241.424,null,null,null,null,null,null,null,null,null,null,"Mole Valley",1519.25,1772.46,2025.67,2278.88,2785.3,3291.71,3798.13,4557.76]
["New Forest",1643.557,1917.4754999999998,2191.4054999999998,2465.3354999999997,3013.1839999999997,3561.0439999999999,4108.8924999999999,4930.6709999999994,null,null,null,null,null,null,null,null,null,null,"New Forest",1429.18,1667.37,1905.57,2143.77,2620.16,3096.56,3572.95,4287.54]
["Newark & Sherwood",1663.9694999999999,1941.2919999999997,2218.6144999999997,2495.9484999999995,3050.6049999999996,3605.2615000000001,4159.9179999999997,4991.896999999999,null,null,null,null,null,null,null,null,null,null,"Newark & Sherwood",1446.93,1688.08,1929.23,2170.39,2652.7,3135.01,3617.32,4340.78]
["Newcastle-under-Lyme",1628.009,1899.3399999999997,2170.6709999999998,2442.0134999999996,2984.6869999999999,3527.3490000000002,4070.0224999999996,4884.0269999999991,null,null,null,null,null,null,null,null,null,null,"Newcastle-under-Lyme",1415.66,1651.6,1887.54,2123.4899999999998,2595.38,3067.26,3539.15,4246.9799999999996]
["Newcastle-upon-Tyne",1600.8344999999999,1867.6344999999999,2134.4344999999998,2401.2459999999996,2934.8575000000001,3468.4689999999996,4002.0805,4802.4919999999993,null,null,null,null,null,null,null,null,null,null,"Newcastle-upon-Tyne",1392.03,1624.03,1856.03,2088.04,2552.0500000000002,3016.06,3480.07,4176.08]
["Newham",1573.3954999999999,1835.6184999999998,2097.8530000000001,2360.0874999999996,2884.5564999999997,3409.0139999999997,3933.4829999999997,4720.1749999999993,null,null,null,null,null,null,null,null,null,null,"Newham",1368.17,1596.19,1824.22,2052.25,2508.31,2964.36,3420.42,4104.5]
["North Devon",1632.3674999999998,1904.4344999999998,2176.4899999999998,2448.5569999999998,2992.6794999999997,3536.8019999999997,4080.9244999999996,4897.1139999999996,null,null,null,null,null,null,null,null,null,null,"North Devon",1419.45,1656.03,1892.6,2129.1799999999998,2602.33,3075.48,3548.63,4258.3599999999997]
["North East Derbyshire",1601.6164999999999,1868.5429999999999,2135.4809999999998,2402.4189999999999,2936.2950000000001,3470.1594999999998,4004.0354999999995,4804.8379999999997,null,null,null,null,null,null,null,null,null,null,"North East Derbyshire",1392.71,1624.82,1856.94,2089.06,2553.3000000000002,3017.53,3481.77,4178.12]
["North East Lincolnshire",1580.9509999999998,1844.4389999999999,2107.9269999999997,2371.4265,2898.4139999999998,3425.3899999999994,3952.3774999999996,4742.8530000000001,null,null,null,null,null,null,null,null,null,null,"North East Lincolnshire",1374.74,1603.86,1832.98,2062.11,2520.36,2978.6,3436.85,4124.22]
["North Hertfordshire",1619.4644999999998,1889.3695,2159.2745,2429.1909999999998,2969.0124999999998,3508.8339999999994,4048.6554999999998,4858.3819999999996,null,null,null,null,null,null,null,null,null,null,"North Hertfordshire",1408.23,1642.93,1877.63,2112.34,2581.75,3051.16,3520.57,4224.68]
["North Kesteven",1697.1584999999998,1980.0239999999999,2262.8779999999997,2545.7435,3111.4629999999997,3677.1824999999999,4242.902,5091.4870000000001,null,null,null,null,null,null,null,null,null,null,"North Kesteven",1475.79,1721.76,1967.72,2213.69,2705.62,3197.55,3689.48,4427.38]
["North Lincolnshire",1633.6784999999998,1905.9639999999997,2178.2379999999998,2450.5234999999998,2995.0829999999996,3539.6424999999995,4084.2019999999998,4901.0469999999996,null,null,null,null,null,null,null,null,null,null,"North Lincolnshire",1420.59,1657.36,1894.12,2130.89,2604.42,3077.95,3551.48,4261.78]
["North Norfolk",1723.183,2010.3724999999999,2297.5735,2584.7745,3159.1649999999995,3733.5669999999996,4307.9574999999995,5169.549,null,null,null,null,null,null,null,null,null,null,"North Norfolk",1498.42,1748.15,1997.89,2247.63,2747.1,3246.58,3746.05,4495.26]
["North Somerset",1674.5264999999997,1953.62,2232.7019999999998,2511.7954999999997,3069.9709999999995,3628.1464999999994,4186.3220000000001,5023.5909999999994,null,null,null,null,null,null,null,null,null,null,"North Somerset",1456.11,1698.8,1941.48,2184.17,2669.54,3154.91,3640.28,4368.34]
["North Tyneside",1848.9354999999998,2157.0895,2465.2435,2773.3975,3389.7055,4006.0134999999996,4622.3329999999996,5546.7950000000001,null,null,null,null,null,null,null,null,null,null,"North Tyneside",1607.77,1875.73,2143.69,2411.65,2947.57,3483.49,4019.42,4823.3]
["North Warwickshire",1676.1019999999999,1955.4485,2234.7949999999996,2514.1529999999998,3072.8575000000001,3631.5504999999994,4190.2549999999992,5028.3059999999996,null,null,null,null,null,null,null,null,null,null,"North Warwickshire",1457.48,1700.39,1943.3,2186.2199999999998,2672.05,3157.87,3643.7,4372.4399999999996]
["North West Leicestershire",1628.8944999999999,1900.3749999999998,2171.8554999999997,2443.3359999999998,2986.297,3529.2579999999998,4072.2304999999997,4886.6719999999996,null,null,null,null,null,null,null,null,null,null,"North West Leicestershire",1416.43,1652.5,1888.57,2124.64,2596.7800000000002,3068.92,3541.07,4249.28]
["Northumberland",1702.0229999999999,1985.6934999999999,2269.3639999999996,2553.0345000000002,3120.3754999999996,3687.7164999999995,4255.0574999999999,5106.0690000000004,null,null,null,null,null,null,null,null,null,null,"Northumberland",1480.02,1726.69,1973.36,2220.0300000000002,2713.37,3206.71,3700.05,4440.0600000000004]
["Norwich",1788.204,2086.2379999999998,2384.2719999999999,2682.306,3278.3739999999998,3874.4419999999996,4470.5099999999993,5364.6120000000001,null,null,null,null,null,null,null,null,null,null,"Norwich",1554.96,1814.12,2073.2800000000002,2332.44,2850.76,3369.08,3887.4,4664.88]
["Nuneaton & Bedworth",1764.5139999999997,2058.5919999999996,2352.6814999999997,2646.7709999999997,3234.9384999999993,3823.1174999999994,4411.2849999999999,5293.5419999999995,null,null,null,null,null,null,null,null,null,null,"Nuneaton & Bedworth",1534.36,1790.08,2045.81,2301.54,2812.99,3324.45,3835.9,4603.08]
["Oadby & Wigston",1505.2809999999999,1756.1649999999997,2007.0374999999999,2257.9214999999999,2759.6779999999994,3261.4459999999999,3763.2024999999994,4515.8429999999998,null,null,null,null,null,null,null,null,null,null,"Oadby & Wigston",1308.94,1527.1,1745.25,1963.41,2399.7199999999998,2836.04,3272.35,3926.82]
["Oldham",1618.8664999999999,1888.6679999999999,2158.4809999999998,2428.2939999999999,2967.92,3507.5344999999998,4047.1604999999995,4856.5879999999997,null,null,null,null,null,null,null,null,null,null,"Oldham",1407.71,1642.32,1876.94,2111.56,2580.8000000000002,3050.03,3519.27,4223.12]
["Oxford",1518.5864999999999,1771.6784999999998,2024.7704999999999,2277.8739999999998,2784.0694999999996,3290.2649999999994,3796.4604999999997,4555.7479999999996,null,null,null,null,null,null,null,null,null,null,"Oxford",1320.51,1540.59,1760.67,1980.76,2420.9299999999998,2861.1,3301.27,3961.52]
["Pendle",1734.2804999999998,2023.3329999999999,2312.3739999999998,2601.4265,3179.52,3757.6134999999995,4335.7069999999994,5202.8530000000001,null,null,null,null,null,null,null,null,null,null,"Pendle",1508.07,1759.42,2010.76,2262.11,2764.8,3267.49,3770.18,4524.22]
["Peterborough",1729.7954999999999,2018.0889999999997,2306.3824999999997,2594.6875,3171.2859999999996,3747.8845000000001,4324.4830000000002,5189.375,null,null,null,null,null,null,null,null,null,null,"Peterborough",1504.17,1754.86,2005.55,2256.25,2757.64,3259.03,3760.42,4512.5]
["Plymouth",1514.7455,1767.1934999999999,2019.6529999999998,2272.1124999999997,2777.0314999999996,3281.9389999999999,3786.8579999999997,4544.2249999999995,null,null,null,null,null,null,null,null,null,null,"Plymouth",1317.17,1536.69,1756.22,1975.75,2414.81,2853.86,3292.92,3951.5]
["Portsmouth",1687.7974999999999,1969.0989999999999,2250.4004999999997,2531.7019999999998,3094.3049999999994,3656.8964999999994,4219.4994999999999,5063.4039999999995,null,null,null,null,null,null,null,null,null,null,"Portsmouth",1467.65,1712.26,1956.87,2201.48,2690.7,3179.91,3669.13,4402.96]
["Preston",1600.1789999999999,1866.8754999999996,2133.5719999999997,2400.2684999999997,2933.6615000000002,3467.0544999999997,4000.4474999999998,4800.5369999999994,null,null,null,null,null,null,null,null,null,null,"Preston",1391.46,1623.37,1855.28,2087.19,2551.0100000000002,3014.83,3478.65,4174.38]
["Reading",1720.6299999999999,2007.3939999999998,2294.1695,2580.9450000000002,3154.4845,3728.0354999999995,4301.5749999999998,5161.8900000000003,null,null,null,null,null,null,null,null,null,null,"Reading",1496.2,1745.56,1994.93,2244.3000000000002,2743.03,3241.77,3740.5,4488.6000000000004]
["Redbridge",1607.8724999999999,1875.8454999999999,2143.8184999999999,2411.8029999999994,2947.7604999999999,3483.7179999999998,4019.6754999999994,4823.6059999999989,null,null,null,null,null,null,null,null,null,null,"Redbridge",1398.15,1631.17,1864.19,2097.2199999999998,2563.27,3029.32,3495.37,4194.4399999999996]
["Redcar & Cleveland",1701.2524999999998,1984.7964999999999,2268.3404999999998,2551.8845000000001,3118.9724999999999,3686.049,4253.1369999999997,5103.7690000000002,null,null,null,null,null,null,null,null,null,null,"Redcar & Cleveland",1479.35,1725.91,1972.47,2219.0300000000002,2712.15,3205.26,3698.38,4438.0600000000004]
["Redditch",1591.6919999999998,1856.9739999999999,2122.2559999999999,2387.5379999999996,2918.1019999999999,3448.6659999999997,3979.2299999999996,4775.0759999999991,null,null,null,null,null,null,null,null,null,null,"Redditch",1384.08,1614.76,1845.44,2076.12,2537.48,2998.84,3460.2,4152.24]
["Reigate & Banstead",1694.962,1977.4479999999999,2259.9454999999998,2542.4430000000002,3107.4265,3672.4214999999995,4237.4049999999997,5084.8860000000004,null,null,null,null,null,null,null,null,null,null,"Reigate & Banstead",1473.88,1719.52,1965.17,2210.8200000000002,2702.11,3193.41,3684.7,4421.6400000000003]
["Ribble Valley",1783.8109999999999,2081.1089999999999,2378.4069999999997,2675.7165,3270.3240000000001,3864.92,4459.5274999999992,5351.433,null,null,null,null,null,null,null,null,null,null,"Ribble Valley",1551.14,1809.66,2068.1799999999998,2326.71,2843.76,3360.8,3877.85,4653.42]
["Richmondshire",1629.9984999999999,1901.6629999999998,2173.3389999999999,2445.0034999999998,2988.3325,3531.6729999999998,4075.0019999999995,4890.0069999999996,null,null,null,null,null,null,null,null,null,null,"Richmondshire",1417.39,1653.62,1889.86,2126.09,2598.5500000000002,3071.02,3543.48,4252.18]
["Rochdale",{"$f":"U196*115%","v":1660.577},{"$f":"V196*115%","v":1937.336},{"$f":"W196*115%","v":2214.0949999999998},{"$f":"X196*115%","v":2490.8654999999994},{"$f":"Y196*115%","v":3044.395},{"$f":"Z196*115%","v":3597.9129999999996},{"$f":"AA196*115%","v":4151.4424999999992},{"$f":"AB196*115%","v":4981.7309999999989},null,null,null,null,null,null,null,null,null,null,"Rochdale",1443.98,1684.64,1925.3,2165.9699999999998,2647.3,3128.62,3609.95,4331.9399999999996]
["Rochford",1664.1074999999998,1941.453,2218.7984999999999,2496.1554999999998,3050.8579999999997,3605.5604999999996,4160.2629999999999,4992.3109999999997,null,null,null,null,null,null,null,null,null,null,"Rochford",1447.05,1688.22,1929.39,2170.5700000000002,2652.92,3135.27,3617.62,4341.1400000000003]
["Rossendale",1771.4024999999997,2066.6419999999998,2361.87,2657.1095,3247.5769999999998,3838.0444999999995,4428.5119999999997,5314.2190000000001,null,null,null,null,null,null,null,null,null,null,"Rossendale",1540.35,1797.08,2053.8000000000002,2310.5300000000002,2823.98,3337.43,3850.88,4621.0600000000004]
["Rother",1547.2214999999999,1805.0974999999999,2062.962,2320.8379999999997,2836.5785000000001,3352.3189999999995,3868.0594999999998,4641.6759999999995,null,null,null,null,null,null,null,null,null,null,"Rother",1345.41,1569.65,1793.88,2018.12,2466.59,2915.06,3363.53,4036.24]
["Rotherham",1856.5484999999999,2165.9674999999997,2475.3865000000001,2784.8169999999996,3403.6664999999998,4022.5160000000001,4641.365499999999,5569.6339999999991,null,null,null,null,null,null,null,null,null,null,"Rotherham",1614.39,1883.45,2152.5100000000002,2421.58,2959.71,3497.84,4035.97,4843.16]
["Rugby",1697.0435,1979.8744999999999,2262.7169999999996,2545.5594999999998,3111.2444999999998,3676.9180000000001,4242.6029999999992,5091.1189999999997,null,null,null,null,null,null,null,null,null,null,"Rugby",1475.69,1721.63,1967.58,2213.5300000000002,2705.43,3197.32,3689.22,4427.0600000000004]
["Runnymede",1479.7394999999999,1726.357,1972.9745,2219.6034999999997,2712.85,3206.0964999999997,3699.3429999999998,4439.2069999999994,null,null,null,null,null,null,null,null,null,null,"Runnymede",1286.73,1501.18,1715.63,1930.09,2359,2787.91,3216.82,3860.18]
["Rushcliffe",1709.751,1994.7094999999997,2279.6679999999997,2564.6264999999999,3134.5434999999998,3704.4604999999997,4274.3774999999996,5129.2529999999997,null,null,null,null,null,null,null,null,null,null,"Rushcliffe",1486.74,1734.53,1982.32,2230.11,2725.69,3221.27,3716.85,4460.22]
["Rutland",1688.1885,1969.559,2250.9179999999997,2532.2884999999997,3095.018,3657.7474999999999,4220.4769999999999,5064.5769999999993,null,null,null,null,null,null,null,null,null,null,"Rutland",1467.99,1712.66,1957.32,2201.9899999999998,2691.32,3180.65,3669.98,4403.9799999999996]
["Ryedale",1660.4849999999999,1937.2324999999998,2213.98,2490.7274999999995,3044.2224999999999,3597.7174999999993,4151.2124999999996,4981.454999999999,null,null,null,null,null,null,null,null,null,null,"Ryedale",1443.9,1684.55,1925.2,2165.85,2647.15,3128.45,3609.75,4331.7]
["Salford",1610.5059999999999,1878.9274999999998,2147.3374999999996,2415.7589999999996,2952.5904999999993,3489.4334999999996,4026.2649999999994,4831.5179999999991,null,null,null,null,null,null,null,null,null,null,"Salford",1400.44,1633.85,1867.25,2100.66,2567.4699999999998,3034.29,3501.1,4201.32]
["Sandwell",1554.2134999999998,1813.2394999999999,2072.277,2331.3145,2849.3894999999998,3367.4529999999995,3885.5279999999993,4662.6289999999999,null,null,null,null,null,null,null,null,null,null,"Sandwell",1351.49,1576.73,1801.98,2027.23,2477.73,2928.22,3378.72,4054.46]
["Scarborough",1447.7235000000001,1689.0165,1930.2979999999998,2171.5909999999999,2654.1654999999996,3136.74,3619.3145,4343.1819999999998,null,null,null,null,null,null,null,null,null,null,"Scarborough",1258.8900000000001,1468.71,1678.52,1888.34,2307.9699999999998,2727.6,3147.23,3776.68]
["Sedgemoor",1668.3049999999998,1946.3519999999999,2224.3989999999999,2502.4575,3058.5629999999996,3614.6569999999997,4170.7624999999998,5004.915,null,null,null,null,null,null,null,null,null,null,"Sedgemoor",1450.7,1692.48,1934.26,2176.0500000000002,2659.62,3143.18,3626.75,4352.1000000000004]
["Sefton",1558.3419999999999,1818.0694999999998,2077.7855,2337.5129999999999,2856.9564999999998,3376.4115000000002,3895.8549999999996,4675.0259999999998,null,null,null,null,null,null,null,null,null,null,"Sefton",1355.08,1580.93,1806.77,2032.62,2484.31,2936.01,3387.7,4065.24]
["Selby",1680.0004999999996,1960.0024999999998,2240.0044999999996,2520.0065,3080.0104999999999,3640.0029999999997,4200.0069999999996,5040.0129999999999,null,null,null,null,null,null,null,null,null,null,"Selby",1460.87,1704.35,1947.83,2191.31,2678.27,3165.22,3652.18,4382.62]
["Sevenoaks",1733.579,2022.5049999999999,2311.431,2600.3685,3178.2319999999995,3756.0839999999994,4333.9475000000002,5200.7370000000001,null,null,null,null,null,null,null,null,null,null,"Sevenoaks",1507.46,1758.7,2009.94,2261.19,2763.68,3266.16,3768.65,4522.38]
["Sheffield",1561.1019999999999,1821.2894999999999,2081.4654999999998,2341.6529999999998,2862.0164999999997,3382.3914999999997,3902.7549999999997,4683.3059999999996,null,null,null,null,null,null,null,null,null,null,"Sheffield",1357.48,1583.73,1809.97,2036.22,2488.71,2941.21,3393.7,4072.44]
["Shropshire",1545.1975,1802.7284999999997,2060.2594999999997,2317.7905000000001,2832.8524999999995,3347.9144999999999,3862.9879999999994,4635.5810000000001,null,null,null,null,null,null,null,null,null,null,"Shropshire",1343.65,1567.59,1791.53,2015.47,2463.35,2911.23,3359.12,4030.94]
["Slough",1650.9974999999999,1926.1695,2201.33,2476.502,3026.8344999999999,3577.1669999999995,4127.4994999999999,4953.0039999999999,null,null,null,null,null,null,null,null,null,null,"Slough",1435.65,1674.93,1914.2,2153.48,2632.03,3110.58,3589.13,4306.96]
["Solihull",1717.4444999999998,2003.6794999999997,2289.9144999999999,2576.1609999999996,3148.6424999999995,3721.1239999999998,4293.6054999999997,5152.3219999999992,null,null,null,null,null,null,null,null,null,null,"Solihull",1493.43,1742.33,1991.23,2240.14,2737.95,3235.76,3733.57,4480.28]
["Somerset West & Taunton",1642.4414999999999,1916.1759999999999,2189.9105,2463.6564999999996,3011.1369999999997,3558.6174999999994,4106.098,4927.3129999999992,null,null,null,null,null,null,null,null,null,null,"Somerset West & Taunton",1428.21,1666.24,1904.27,2142.31,2618.38,3094.45,3570.52,4284.62]
["South Cambridgeshire",1546.6695,1804.4419999999998,2062.2145,2319.9985000000001,2835.5549999999994,3351.1115,3866.6679999999997,4639.9970000000003,null,null,null,null,null,null,null,null,null,null,"South Cambridgeshire",1344.93,1569.08,1793.23,2017.39,2465.6999999999998,2914.01,3362.32,4034.78]
["South Derbyshire",1602.9504999999997,1870.107,2137.2749999999996,2404.4314999999997,2938.7444999999998,3473.0689999999995,4007.3819999999996,4808.8629999999994,null,null,null,null,null,null,null,null,null,null,"South Derbyshire",1393.87,1626.18,1858.5,2090.81,2555.4299999999998,3020.06,3484.68,4181.62]
["South Gloucestershire",1578.0759999999998,1841.0925,2104.0974999999999,2367.114,2893.1354999999999,3419.1684999999998,3945.1899999999996,4734.2280000000001,null,null,null,null,null,null,null,null,null,null,"South Gloucestershire",1372.24,1600.95,1829.65,2058.36,2515.77,2973.19,3430.6,4116.72]
["South Hams",1297.9014999999997,1514.2165,1730.5429999999999,1946.8579999999999,2379.4879999999998,2812.1294999999996,3244.7595000000001,3893.7159999999999,null,null,null,null,null,null,null,null,null,null,"South Hams",1128.6099999999999,1316.71,1504.82,1692.92,2069.12,2445.33,2821.53,3385.84]
["South Holland",1688.0389999999998,1969.3749999999998,2250.7109999999998,2532.0584999999996,3094.7419999999997,3657.4139999999998,4220.0974999999999,5064.1169999999993,null,null,null,null,null,null,null,null,null,null,"South Holland",1467.86,1712.5,1957.14,2201.79,2691.08,3180.36,3669.65,4403.58]
["South Kesteven",1605.3884999999998,1872.9590000000001,2140.5179999999996,2408.0884999999994,2943.2179999999998,3478.3474999999999,4013.4769999999999,4816.1769999999988,null,null,null,null,null,null,null,null,null,null,"South Kesteven",1395.99,1628.66,1861.32,2093.9899999999998,2559.3200000000002,3024.65,3489.98,4187.9799999999996]
["South Lakeland",1589.8174999999999,1854.7889999999998,2119.7604999999999,2384.7319999999995,2914.6749999999997,3444.6064999999999,3974.5494999999996,4769.463999999999,null,null,null,null,null,null,null,null,null,null,"South Lakeland",1382.45,1612.86,1843.27,2073.6799999999998,2534.5,2995.31,3456.13,4147.3599999999997]
["South Norfolk",1542.4144999999999,1799.4854999999998,2056.5564999999997,2313.6274999999996,2827.7694999999994,3341.8999999999996,3856.0419999999995,4627.2549999999992,null,null,null,null,null,null,null,null,null,null,"South Norfolk",1341.23,1564.77,1788.31,2011.85,2458.9299999999998,2906,3353.08,4023.7]
["South Oxfordshire",1562.6084999999998,1823.0489999999998,2083.4780000000001,2343.9184999999998,2864.7879999999996,3385.6574999999998,3906.5269999999996,4687.8369999999995,null,null,null,null,null,null,null,null,null,null,"South Oxfordshire",1358.79,1585.26,1811.72,2038.19,2491.12,2944.05,3396.98,4076.38]
["South Ribble",1591.5539999999999,1856.8129999999996,2122.0719999999997,2387.3309999999997,2917.8490000000002,3448.3669999999997,3978.8849999999998,4774.6619999999994,null,null,null,null,null,null,null,null,null,null,"South Ribble",1383.96,1614.62,1845.28,2075.94,2537.2600000000002,2998.58,3459.9,4151.88]
["South Somerset",1713.2354999999998,1998.7804999999998,2284.3139999999999,2569.8589999999995,3140.9374999999995,3712.0160000000001,4283.0944999999992,5139.7179999999989,null,null,null,null,null,null,null,null,null,null,"South Somerset",1489.77,1738.07,1986.36,2234.66,2731.25,3227.84,3724.43,4469.32]
["South Staffordshire",1652.1475,1927.5034999999998,2202.8709999999996,2478.2269999999999,3028.9389999999999,3579.6624999999999,4130.3744999999999,4956.4539999999997,null,null,null,null,null,null,null,null,null,null,"South Staffordshire",1436.65,1676.09,1915.54,2154.98,2633.86,3112.75,3591.63,4309.96]
["South Tyneside",1456.0034999999998,1698.6649999999997,1941.3264999999997,2183.9994999999999,2669.3339999999998,3154.6684999999998,3640.0029999999997,4367.9989999999998,null,null,null,null,null,null,null,null,null,null,"South Tyneside",1266.0899999999999,1477.1,1688.11,1899.13,2321.16,2743.19,3165.22,3798.26]
["Southampton",1723.3439999999998,2010.5679999999998,2297.7919999999999,2585.0160000000001,3159.4639999999999,3733.9119999999998,4308.3599999999997,5170.0320000000002,null,null,null,null,null,null,null,null,null,null,"Southampton",1498.56,1748.32,1998.08,2247.84,2747.36,3246.88,3746.4,4495.68]
["Southend-on-Sea",1570.4284999999998,1832.1569999999999,2093.8969999999999,2355.6369999999997,2879.1169999999997,3402.5854999999997,3926.0654999999992,4711.2739999999994,null,null,null,null,null,null,null,null,null,null,"Southend-on-Sea",1365.59,1593.18,1820.78,2048.38,2503.58,2958.77,3413.97,4096.76]
["Southwark",1605.7334999999998,1873.3614999999998,2140.9780000000001,2408.6059999999998,2943.8504999999996,3479.0949999999998,4014.3394999999996,4817.2119999999995,null,null,null,null,null,null,null,null,null,null,"Southwark",1396.29,1629.01,1861.72,2094.44,2559.87,3025.3,3490.73,4188.88]
["Spelthorne",1599.4199999999998,1865.9899999999998,2132.56,2399.1299999999997,2932.27,3465.41,3998.5499999999997,4798.2599999999993,null,null,null,null,null,null,null,null,null,null,"Spelthorne",1390.8,1622.6,1854.4,2086.1999999999998,2549.8000000000002,3013.4,3477,4172.3999999999996]
["St Albans",1599.5235,1866.105,2132.6864999999998,2399.2794999999996,2932.4539999999997,3465.6284999999998,3998.8029999999994,4798.5589999999993,null,null,null,null,null,null,null,null,null,null,"St Albans",1390.89,1622.7,1854.51,2086.33,2549.96,3013.59,3477.22,4172.66]
["St Helens",1543.2539999999999,1800.4629999999997,2057.672,2314.8809999999999,2829.299,3343.7169999999996,3858.1349999999998,4629.7619999999997,null,null,null,null,null,null,null,null,null,null,"St Helens",1341.96,1565.62,1789.28,2012.94,2460.2600000000002,2907.58,3354.9,4025.88]
["Stafford",1726.8975,2014.7194999999999,2302.5299999999997,2590.3519999999999,3165.9845,3741.6169999999997,4317.2494999999999,5180.7039999999997,null,null,null,null,null,null,null,null,null,null,"Stafford",1501.65,1751.93,2002.2,2252.48,2753.03,3253.58,3754.13,4504.96]
["Staffordshire Moorlands",1747.4594999999999,2038.7084999999997,2329.9459999999999,2621.1950000000002,3203.6814999999997,3786.1680000000001,4368.6544999999996,5242.3900000000003,null,null,null,null,null,null,null,null,null,null,"Staffordshire Moorlands",1519.53,1772.79,2026.04,2279.3000000000002,2785.81,3292.32,3798.83,4558.6000000000004]
["Stevenage",1483.96,1731.2904999999998,1978.6094999999998,2225.9399999999996,2720.5894999999996,3215.2504999999996,3709.8999999999996,4451.8799999999992,null,null,null,null,null,null,null,null,null,null,"Stevenage",1290.4000000000001,1505.47,1720.53,1935.6,2365.73,2795.87,3226,3871.2]
["Stockport",1532.26,1787.6405,2043.0094999999999,2298.39,2809.1394999999998,3319.9004999999997,3830.6499999999996,4596.78,null,null,null,null,null,null,null,null,null,null,"Stockport",1332.4,1554.47,1776.53,1998.6,2442.73,2886.87,3331,3997.2]
["Stockton-on-Tees",1530.1324999999999,1785.1449999999998,2040.1689999999999,2295.1929999999998,2805.241,3315.2774999999997,3825.3254999999995,4590.3859999999995,null,null,null,null,null,null,null,null,null,null,"Stockton-on-Tees",1330.55,1552.3,1774.06,1995.82,2439.34,2882.85,3326.37,3991.64]
["Stoke-on-Trent",1555.5014999999999,1814.7574999999997,2074.002,2333.2579999999998,2851.7584999999999,3370.2589999999996,3888.7595000000001,4666.5159999999996,null,null,null,null,null,null,null,null,null,null,"Stoke-on-Trent",1352.61,1578.05,1803.48,2028.92,2479.79,2930.66,3381.53,4057.84]
["Stratford-on-Avon",1666.0969999999998,1943.7759999999998,2221.4549999999999,2499.1455000000001,3054.5149999999999,3609.8729999999996,4165.2424999999994,4998.2910000000002,null,null,null,null,null,null,null,null,null,null,"Stratford-on-Avon",1448.78,1690.24,1931.7,2173.17,2656.1,3139.02,3621.95,4346.34]
["Stroud",1608.8844999999999,1877.03,2145.1754999999998,2413.3209999999999,2949.6120000000001,3485.9029999999993,4022.2055,4826.6419999999998,null,null,null,null,null,null,null,null,null,null,"Stroud",1399.03,1632.2,1865.37,2098.54,2564.88,3031.22,3497.57,4197.08]
["Sunderland",1455.8309999999999,1698.4694999999999,1941.1079999999999,2183.7464999999997,2669.0234999999998,3154.3004999999998,3639.5774999999994,4367.4929999999995,null,null,null,null,null,null,null,null,null,null,"Sunderland",1265.94,1476.93,1687.92,1898.91,2320.89,2742.87,3164.85,3797.82]
["Surrey Heath",1661.1405,1938.0029999999999,2214.8539999999998,2491.7165,3045.4299999999994,3599.1434999999997,4152.8569999999991,4983.433,null,null,null,null,null,null,null,null,null,null,"Surrey Heath",1444.47,1685.22,1925.96,2166.71,2648.2,3129.69,3611.18,4333.42]
["Sutton",1641.5904999999998,1915.1869999999999,2188.7835,2462.3799999999997,3009.5729999999999,3556.7660000000001,4103.9704999999994,4924.7599999999993,null,null,null,null,null,null,null,null,null,null,"Sutton",1427.47,1665.38,1903.29,2141.1999999999998,2617.02,3092.84,3568.67,4282.3999999999996]
["Swale",1729.0364999999999,2017.2149999999997,2305.3820000000001,2593.5604999999996,3169.9059999999999,3746.2514999999999,4322.5969999999998,5187.1209999999992,null,null,null,null,null,null,null,null,null,null,"Swale",1503.51,1754.1,2004.68,2255.27,2756.44,3257.61,3758.78,4510.54]
["Swindon",1212.1115,1414.1320000000001,1616.1524999999997,1818.1729999999998,2222.2139999999995,2626.2435,3030.2845000000002,3636.3459999999995,null,null,null,null,null,null,null,null,null,null,"Swindon",1054.01,1229.68,1405.35,1581.02,1932.36,2283.69,2635.03,3162.04]
["Tameside",1439.8574999999998,1679.8394999999998,1919.81,2159.7919999999999,2639.7444999999998,3119.6970000000001,3599.6495,4319.5839999999998,null,null,null,null,null,null,null,null,null,null,"Tameside",1252.05,1460.73,1669.4,1878.08,2295.4299999999998,2712.78,3130.13,3756.16]
["Tamworth",1636.9675,1909.7935,2182.6194999999998,2455.4454999999998,3001.0974999999999,3546.7494999999999,4092.4129999999996,4910.8909999999996,null,null,null,null,null,null,null,null,null,null,"Tamworth",1423.45,1660.69,1897.93,2135.17,2609.65,3084.13,3558.62,4270.34]
["Tandridge",1567.5764999999997,1828.8449999999998,2090.1019999999999,2351.3705,2873.8959999999997,3396.4214999999995,3918.9470000000001,4702.741,null,null,null,null,null,null,null,null,null,null,"Tandridge",1363.11,1590.3,1817.48,2044.67,2499.04,2953.41,3407.78,4089.34]
["Teignbridge",1710.1304999999998,1995.1464999999998,2280.1624999999999,2565.1899999999996,3135.2334999999998,3705.2769999999996,4275.3204999999998,5130.3799999999992,null,null,null,null,null,null,null,null,null,null,"Teignbridge",1487.07,1734.91,1982.75,2230.6,2726.29,3221.98,3717.67,4461.2]
["Tendring",1518.4139999999998,1771.4829999999999,2024.5519999999999,2277.6209999999996,2783.7589999999996,3289.8969999999999,3796.0349999999999,4555.2419999999993,null,null,null,null,null,null,null,null,null,null,"Tendring",1320.36,1540.42,1760.48,1980.54,2420.66,2860.78,3300.9,3961.08]
["Test Valley",1733.4754999999998,2022.3784999999998,2311.2929999999997,2600.2075,3178.0365000000002,3755.8539999999998,4333.683,5200.415,null,null,null,null,null,null,null,null,null,null,"Test Valley",1507.37,1758.59,2009.82,2261.0500000000002,2763.51,3265.96,3768.42,4522.1000000000004]
["Tewkesbury",1575.9254999999998,1838.5739999999998,2101.2224999999999,2363.8825000000002,2889.1909999999998,3414.4994999999999,3939.808,4727.7650000000003,null,null,null,null,null,null,null,null,null,null,"Tewkesbury",1370.37,1598.76,1827.15,2055.5500000000002,2512.34,2969.13,3425.92,4111.1000000000004]
["Thanet",706.3415,824.05549999999994,941.78099999999995,1059.5065,1294.9574999999998,1530.3969999999999,1765.848,2119.0129999999999,null,null,null,null,null,null,null,null,null,null,"Thanet",614.21,716.57,818.94,921.31,1126.05,1330.78,1535.52,1842.62]
["Three Rivers",1586.9424999999999,1851.4309999999998,2115.9195,2380.4079999999999,2909.3849999999998,3438.3620000000001,3967.3504999999996,4760.8159999999998,null,null,null,null,null,null,null,null,null,null,"Three Rivers",1379.95,1609.94,1839.93,2069.92,2529.9,2989.88,3449.87,4139.84]
["Thurrock",1643.9709999999998,1917.9584999999997,2191.9575,2465.9564999999998,3013.9429999999998,3561.9409999999998,4109.9274999999998,4931.9129999999996,null,null,null,null,null,null,null,null,null,null,"Thurrock",1429.54,1667.79,1906.05,2144.31,2620.8200000000002,3097.34,3573.85,4288.62]
["Tonbridge & Malling",{"$f":"U260*115%","v":1636.4385},{"$f":"V260*115%","v":1909.1724999999999},{"$f":"W260*115%","v":2181.9064999999996},{"$f":"X260*115%","v":2454.652},{"$f":"Y260*115%","v":3000.1314999999995},{"$f":"Z260*115%","v":3545.6109999999994},{"$f":"AA260*115%","v":4091.0904999999993},{"$f":"AB260*115%","v":4909.3040000000001},null,null,null,null,null,null,null,null,null,null,"Tonbridge & Malling",1422.99,1660.15,1897.31,2134.48,2608.81,3083.14,3557.47,4268.96]
["Torbay",1734.7979999999998,2023.9309999999998,2313.0639999999999,2602.1970000000001,3180.4629999999997,3758.7289999999998,4336.9949999999999,5204.3940000000002,null,null,null,null,null,null,null,null,null,null,"Torbay",1508.52,1759.94,2011.36,2262.7800000000002,2765.62,3268.46,3771.3,4525.5600000000004]
["Torridge",1811.6524999999997,2113.5965000000001,2415.5404999999996,2717.4845,3321.3724999999999,3925.2489999999998,4529.1369999999997,5434.9690000000001,null,null,null,null,null,null,null,null,null,null,"Torridge",1575.35,1837.91,2100.4699999999998,2363.0300000000002,2888.15,3413.26,3938.38,4726.0600000000004]
["Tower Hamlets",1625.8584999999998,1896.8329999999999,2167.819,2438.7934999999998,2980.7424999999994,3522.7029999999995,4064.6519999999996,4877.5869999999995,null,null,null,null,null,null,null,null,null,null,"Tower Hamlets",1413.79,1649.42,1885.06,2120.69,2591.9499999999998,3063.22,3534.48,4241.38]
["Trafford",1650.3649999999998,1925.4219999999998,2200.4789999999998,2475.5475000000001,3025.6729999999998,3575.7869999999998,4125.9124999999995,4951.0950000000003,null,null,null,null,null,null,null,null,null,null,"Trafford",1435.1,1674.28,1913.46,2152.65,2631.02,3109.38,3587.75,4305.3]
["Tunbridge Wells",1799.2094999999999,2099.0719999999997,2398.9344999999998,2698.8084999999996,3298.5450000000001,3898.2814999999996,4498.018,5397.6169999999993,null,null,null,null,null,null,null,null,null,null,"Tunbridge Wells",1564.53,1825.28,2086.0300000000002,2346.79,2868.3,3389.81,3911.32,4693.58]
["Uttlesford",1650.2614999999998,1925.2954999999999,2200.3409999999999,2475.3865000000001,3025.4774999999995,3575.5569999999993,4125.6479999999992,4950.7730000000001,null,null,null,null,null,null,null,null,null,null,"Uttlesford",1435.01,1674.17,1913.34,2152.5100000000002,2630.85,3109.18,3587.52,4305.0200000000004]
["Vale of White Horse",1618.211,1887.9089999999999,2157.607,2427.3164999999999,2966.7240000000002,3506.12,4045.5274999999997,4854.6329999999998,null,null,null,null,null,null,null,null,null,null,"Vale of White Horse",1407.14,1641.66,1876.18,2110.71,2579.7600000000002,3048.8,3517.85,4221.42]
["Wakefield",1644.9485,1919.0969999999998,2193.2570000000001,2467.4169999999999,3015.7370000000001,3564.0454999999997,4112.3654999999999,4934.8339999999998,null,null,null,null,null,null,null,null,null,null,"Wakefield",1430.39,1668.78,1907.18,2145.58,2622.38,3099.17,3575.97,4291.16]
["Walsall",1692.6965,1974.8145,2256.9324999999999,2539.0504999999998,3103.2865000000002,3667.5109999999995,4231.7470000000003,5078.1009999999997,null,null,null,null,null,null,null,null,null,null,"Walsall",1471.91,1717.23,1962.55,2207.87,2698.51,3189.14,3679.78,4415.74]
["Waltham Forest",1565.1499999999999,1826.0044999999998,2086.8589999999999,2347.7249999999999,2869.4454999999998,3391.1544999999996,3912.8749999999995,4695.45,null,null,null,null,null,null,null,null,null,null,"Waltham Forest",1361,1587.83,1814.66,2041.5,2495.17,2948.83,3402.5,4083]
["Wandsworth",700.56849999999997,817.32799999999997,934.08749999999998,1050.847,1284.3659999999998,1517.885,1751.4154999999998,2101.694,null,null,null,null,null,null,null,null,null,null,"Wandsworth",609.19000000000005,710.72,812.25,913.78,1116.8399999999999,1319.9,1522.97,1827.56]
["Warrington",1404.3225,1638.3819999999998,1872.4299999999998,2106.4894999999997,2574.5970000000002,3042.7044999999998,3510.8119999999999,4212.9789999999994,null,null,null,null,null,null,null,null,null,null,"Warrington",1221.1500000000001,1424.68,1628.2,1831.73,2238.7800000000002,2645.83,3052.88,3663.46]
["Warwick",1699.1594999999998,1982.3469999999998,2265.5344999999998,2548.7334999999998,3115.12,3681.5064999999995,4247.893,5097.4669999999996,null,null,null,null,null,null,null,null,null,null,"Warwick",1477.53,1723.78,1970.03,2216.29,2708.8,3201.31,3693.82,4432.58]
["Watford",1569.2439999999999,1830.7884999999999,2092.3215,2353.8659999999995,2876.9434999999999,3400.0324999999998,3923.1099999999997,4707.7319999999991,null,null,null,null,null,null,null,null,null,null,"Watford",1364.56,1591.99,1819.41,2046.84,2501.69,2956.55,3411.4,4093.68]
["Waverley",1229.6144999999999,1434.5445,1639.4745,1844.4159999999997,2254.2874999999999,2664.1589999999997,3074.0304999999998,3688.8319999999994,null,null,null,null,null,null,null,null,null,null,"Waverley",1069.23,1247.43,1425.63,1603.84,1960.25,2316.66,2673.07,3207.68]
["Wealden",1654.5165,1930.2634999999998,2206.0104999999999,2481.7689999999998,3033.2745,3584.7799999999993,4136.2855,4963.5379999999996,null,null,null,null,null,null,null,null,null,null,"Wealden",1438.71,1678.49,1918.27,2158.06,2637.63,3117.2,3596.77,4316.12]
["Welwyn Hatfield",1724.057,2011.3959999999997,2298.7350000000001,2586.0854999999997,3160.7749999999996,3735.4529999999995,4310.142499999999,5172.1709999999994,null,null,null,null,null,null,null,null,null,null,"Welwyn Hatfield",1499.18,1749.04,1998.9,2248.77,2748.5,3248.22,3747.95,4497.54]
["West Berkshire",1653.9644999999998,1929.6309999999999,2205.2860000000001,2480.9524999999999,3032.2739999999999,3583.5954999999999,4134.9169999999995,4961.9049999999997,null,null,null,null,null,null,null,null,null,null,"West Berkshire",1438.23,1677.94,1917.64,2157.35,2636.76,3116.17,3595.58,4314.7]
["West Devon",1674.8485000000001,1953.9879999999998,2233.1274999999996,2512.2669999999998,3070.5459999999998,3628.8249999999998,4187.1154999999999,5024.5339999999997,null,null,null,null,null,null,null,null,null,null,"West Devon",1456.39,1699.12,1941.85,2184.58,2670.04,3155.5,3640.97,4369.16]
["West Lancashire",1561.1709999999998,1821.37,2081.5574999999999,2341.7565,2862.143,3382.5409999999997,3902.9274999999998,4683.5129999999999,null,null,null,null,null,null,null,null,null,null,"West Lancashire",1357.54,1583.8,1810.05,2036.31,2488.8200000000002,2941.34,3393.85,4072.62]
["West Lindsey",1635.4839999999999,1908.0684999999999,2180.6414999999997,2453.2259999999997,2998.3834999999999,3543.5524999999998,4088.7099999999996,4906.4519999999993,null,null,null,null,null,null,null,null,null,null,"West Lindsey",1422.16,1659.19,1896.21,2133.2399999999998,2607.29,3081.35,3555.4,4266.4799999999996]
["West Oxfordshire",1535.1695,1791.0329999999999,2046.8964999999998,2302.7599999999998,2814.4870000000001,3326.2024999999994,3837.9294999999997,4605.5199999999995,null,null,null,null,null,null,null,null,null,null,"West Oxfordshire",1334.93,1557.42,1779.91,2002.4,2447.38,2892.35,3337.33,4004.8]
["West Suffolk",1649.7554999999998,1924.7204999999999,2199.674,2474.6390000000001,3024.5574999999999,3574.4759999999997,4124.3944999999994,4949.2780000000002,null,null,null,null,null,null,null,null,null,null,"West Suffolk",1434.57,1673.67,1912.76,2151.86,2630.05,3108.24,3586.43,4303.72]
["Westminster",1618.8434999999999,1888.6449999999998,2158.4465,2428.2595000000001,2967.8739999999998,3507.4884999999995,4047.1029999999996,4856.5190000000002,null,null,null,null,null,null,null,null,null,null,"Westminster",1407.69,1642.3,1876.91,2111.5300000000002,2580.7600000000002,3049.99,3519.22,4223.0600000000004]
["Wigan",1502.383,1752.7839999999999,2003.1734999999999,2253.5745000000002,2754.3649999999998,3255.1669999999995,3755.9575,4507.1490000000003,null,null,null,null,null,null,null,null,null,null,"Wigan",1306.42,1524.16,1741.89,1959.63,2395.1,2830.58,3266.05,3919.26]
["Wiltshire",1557.1459999999997,1816.6664999999998,2076.1869999999999,2335.7189999999996,2854.7714999999998,3373.8124999999995,3892.8649999999998,4671.4379999999992,null,null,null,null,null,null,null,null,null,null,"Wiltshire",1354.04,1579.71,1805.38,2031.06,2482.41,2933.75,3385.1,4062.12]
["Winchester",1444.7334999999998,1685.5204999999999,1926.3074999999999,2167.0944999999997,2648.6684999999998,3130.2424999999994,3611.8279999999995,4334.1889999999994,null,null,null,null,null,null,null,null,null,null,"Winchester",1256.29,1465.67,1675.05,1884.43,2303.19,2721.95,3140.72,3768.86]
["Windsor & Maidenhead",1129.231,1317.4399999999998,1505.6374999999998,1693.8464999999999,2070.2529999999997,2446.6709999999998,2823.0774999999999,3387.6929999999998,null,null,null,null,null,null,null,null,null,null,"Windsor & Maidenhead",981.94,1145.5999999999999,1309.25,1472.91,1800.22,2127.54,2454.85,2945.82]
["Wirral",1526.6134999999999,1781.0509999999999,2035.4884999999999,2289.9259999999999,2798.8009999999995,3307.6644999999999,3816.5394999999999,4579.8519999999999,null,null,null,null,null,null,null,null,null,null,"Wirral",1327.49,1548.74,1769.99,1991.24,2433.7399999999998,2876.23,3318.73,3982.48]
["Woking",1598.5804999999998,1865.0124999999998,2131.4445000000001,2397.8764999999999,2930.7404999999994,3463.5929999999998,3996.4569999999994,4795.7529999999997,null,null,null,null,null,null,null,null,null,null,"Woking",1390.07,1621.75,1853.43,2085.11,2548.4699999999998,3011.82,3475.18,4170.22]
["Wokingham",1524.7619999999999,1778.8889999999997,2033.0159999999998,2287.1429999999996,2795.3969999999999,3303.6509999999994,3811.9049999999993,4574.2859999999991,null,null,null,null,null,null,null,null,null,null,"Wokingham",1325.88,1546.86,1767.84,1988.82,2430.7800000000002,2872.74,3314.7,3977.64]
["Wolverhampton",1537.9984999999999,1794.3219999999999,2050.6569999999997,2306.9919999999997,2819.6619999999998,3332.3204999999998,3844.9904999999994,4613.9839999999995,null,null,null,null,null,null,null,null,null,null,"Wolverhampton",1337.39,1560.28,1783.18,2006.08,2451.88,2897.67,3343.47,4012.16]
["Worcester",1435.3724999999999,1674.5954999999999,1913.8184999999999,2153.0529999999999,2631.5104999999999,3109.9679999999998,3588.4254999999994,4306.1059999999998,null,null,null,null,null,null,null,null,null,null,"Worcester",1248.1500000000001,1456.17,1664.19,1872.22,2288.27,2704.32,3120.37,3744.44]
["Worthing",1512.5374999999999,1764.6289999999999,2016.7204999999999,2268.8119999999999,2772.9949999999999,3277.1664999999998,3781.3494999999998,4537.6239999999998,null,null,null,null,null,null,null,null,null,null,"Worthing",1315.25,1534.46,1753.67,1972.88,2411.3000000000002,2849.71,3288.13,3945.76]
["Wychavon",1413.6605,1649.2725,1884.8844999999999,2120.4964999999997,2591.7204999999999,3062.933,3534.1569999999997,4240.9929999999995,null,null,null,null,null,null,null,null,null,null,"Wychavon",1229.27,1434.15,1639.03,1843.91,2253.67,2663.42,3073.18,3687.82]
["Wyre",1522.4849999999999,1776.2324999999998,2029.9799999999998,2283.7274999999995,2791.2224999999999,3298.7174999999997,3806.2124999999996,4567.454999999999,null,null,null,null,null,null,null,null,null,null,"Wyre",1323.9,1544.55,1765.2,1985.85,2427.15,2868.45,3309.75,3971.7]
["Wyre Forest",1486.7199999999998,1734.5104999999999,1982.2894999999999,2230.08,2725.6495,3221.2305000000001,3716.7999999999997,4460.16,null,null,null,null,null,null,null,null,null,null,"Wyre Forest",1292.8,1508.27,1723.73,1939.2,2370.13,2801.07,3232,3878.4]
["York",1387.2909999999997,1618.51,1849.7175,2080.9364999999998,2543.3629999999998,3005.8009999999995,3468.2274999999995,4161.8729999999996,null,null,null,null,null,null,null,null,null,null,"York",1206.3399999999999,1407.4,1608.45,1809.51,2211.62,2613.7399999999998,3015.85,3619.02]

{"sheet":"2 - Income","index":5,"n_rows":66,"n_cols":22,"rows_kept":66,"cut":false,"hidden":true,"merged":[[14,1,15,1],[4,1,4,2],[9,1,9,2],[12,9,13,9],[5,1,6,1],[7,1,8,1],[10,1,11,1],[12,1,13,1],[4,9,4,10],[5,9,6,9],[7,9,8,9],[9,9,9,10],[10,9,11,9],[30,1,30,6],[30,9,30,14],[18,1,18,2],[20,1,21,1],[22,1,23,1],[24,1,25,1],[44,9,45,9],[46,9,47,9],[48,9,49,9],[41,1,41,2],[42,1,43,1],[42,9,43,9],[39,1,40,1],[46,1,47,1],[48,1,49,1],[50,1,50,2],[52,1,53,1],[44,1,45,1],[3,9,3,15],[3,1,3,7],[35,1,35,7],[36,1,36,2],[37,1,38,1],[16,1,17,1],[26,1,26,2],[16,9,17,9],[26,9,26,10],[29,1,29,6],[29,9,29,14],[14,9,15,9],[18,9,18,10],[20,9,21,9],[22,9,23,9],[24,9,25,9],[35,9,35,15],[36,9,36,10],[37,9,38,9],[39,9,40,9],[41,9,41,10],[54,1,55,1],[56,1,57,1],[58,1,58,2],[61,1,61,6],[62,1,62,6],[62,9,62,14],[50,9,50,10],[52,9,53,9],[54,9,55,9],[56,9,57,9],[58,9,58,10],[61,9,61,14],[32,6,32,7],[33,6,33,7],[32,3,32,4],[33,3,33,4],[32,1,33,2],[32,9,33,10],[32,11,32,12],[32,14,32,15],[33,11,33,12],[33,14,33,15],[64,1,65,2],[64,3,64,4],[64,6,64,7],[65,3,65,4],[65,6,65,7],[64,9,65,10],[64,11,64,12],[64,14,64,15],[65,11,65,12],[65,14,65,15]]}
[null,null,null,null,null,null,null,null,null,null,null,null,null,null,null,null,null,null,1,1,null,1]
[null,"Income",null,null,null,null,null,null,null,null,null,null,null,null,null,null,null,null,0.8,0.75,null,2]
[null,null,null,null,null,null,null,null,null,null,null,null,null,null,null,null,null,null,0.5,0.5,null,3]
[null,"Applicant 1",null,null,null,null,null,null,null,"Applicant 2"]
[null,"Employed (Monthly)",null,1,2,"3 (latest)","Weighting","Amount Used",null,"Employed (Monthly)",null,{"$f":"D5","v":1},{"$f":"E5","v":2},{"$f":"F5","v":"3 (latest)"},"Weighting","Amount Used"]
[null,"Basic Pay","Gross Monthly Basic",null,null,null,1,{"$f":"IFERROR((SUM(D6:F6)/COUNTA(D6:F6))*G6,0)","v":0},null,"Basic Pay","Gross Monthly Basic",null,null,null,1,{"$f":"IFERROR((SUM(L6:N6)/COUNTA(L6:N6))*O6,0)","v":0}]
[null,null,"Net Monthly Basic",null,null,null,1,{"$f":"IFERROR((SUM(D7:F7)/COUNTA(D7:F7))*G7,0)","v":0},null,null,"Net Monthly Basic",null,null,null,1,{"$f":"IFERROR((SUM(L7:N7)/COUNTA(L7:N7))*O7,0)","v":0}]
[null,"Overtime","Gross Overtime",null,null,null,0.5,{"$f":"IFERROR((SUM(D8:F8)/COUNTA(D8:F8))*G8,0)","v":0},null,"Overtime","Gross Overtime",null,null,null,0.5,{"$f":"IFERROR((SUM(L8:N8)/COUNTA(L8:N8))*O8,0)","v":0}]
[null,null,"Net Monthly O/T",null,null,null,0.5,0,null,null,"Net Monthly O/T",null,null,null,0.5,0]
[null,"Self-Employed (Annual)",null,1,2,"3 (latest)","AVG","Amount Used",null,"Self-Employed (Annual)",null,1,2,{"$f":"F10","v":"3 (latest)"},"AVG","Amount Used"]
[null,"Net Profit","Gross Net Profit",null,null,null,2,{"$f":"IF(F11=\"\",0,IF(G11=1,F11,IF(G11=2,AVERAGE(E11:F11),IF(G11=3,AVERAGE(D11:F11),\"\"))))","v":0},null,"Net Profit","Gross Net Profit",null,null,null,2,{"$f":"IF(N11=\"\",0,IF(O11=1,N11,IF(O11=2,AVERAGE(M11:N11),IF(O11=3,AVERAGE(L11:N11),\"\"))))","v":0}]
[null,null,"Net Profit After Tax",null,null,null,2,{"$f":"IF(F12=\"\",0,IF(G12=1,F12,IF(G12=2,AVERAGE(E12:F12),IF(G12=3,AVERAGE(D12:F12),\"0\"))))","v":0},null,null,"Net Profit After Tax",null,null,null,2,{"$f":"IF(N12=\"\",0,IF(O12=1,N12,IF(O12=2,AVERAGE(M12:N12),IF(O12=3,AVERAGE(L12:N12),\"0\"))))","v":0}]
[null,"Salary","Gross Salary",null,null,null,2,{"$f":"IF(F13=\"\",0,IF(G13=1,F13,IF(G13=2,AVERAGE(E13:F13),IF(G13=3,AVERAGE(D13:F13),\"\"))))","v":0},null,"Salary","Gross Salary",null,null,null,2,{"$f":"IF(N13=\"\",0,IF(O13=1,N13,IF(O13=2,AVERAGE(M13:N13),IF(O13=3,AVERAGE(L13:N13),\"\"))))","v":0}]
[null,null,"Net Salary",null,null,null,2,{"$f":"IF(F14=\"\",0,IF(G14=1,F14,IF(G14=2,AVERAGE(E14:F14),IF(G14=3,AVERAGE(D14:F14),\"\"))))","v":0},null,null,"Net Salary",null,null,null,2,{"$f":"IF(N14=\"\",0,IF(O14=1,N14,IF(O14=2,AVERAGE(M14:N14),IF(O14=3,AVERAGE(L14:N14),\"\"))))","v":0}]
[null,"Dividends","Gross Dividends",null,null,null,2,{"$f":"IF(F15=\"\",0,IF(G15=1,F15,IF(G15=2,AVERAGE(E15:F15),IF(G15=3,AVERAGE(D15:F15),\"\"))))","v":0},null,"Dividends","Gross Dividends",null,null,null,2,{"$f":"IF(N15=\"\",0,IF(O15=1,N15,IF(O15=2,AVERAGE(M15:N15),IF(O15=3,AVERAGE(L15:N15),\"\"))))","v":0}]
[null,null,"Net Dividends",null,null,null,2,{"$f":"IF(F16=\"\",0,IF(G16=1,F16,IF(G16=2,AVERAGE(E16:F16),IF(G16=3,AVERAGE(D16:F16),\"\"))))","v":0},null,null,"Net Dividends",null,null,null,2,{"$f":"IF(N16=\"\",0,IF(O16=1,N16,IF(O16=2,AVERAGE(M16:N16),IF(O16=3,AVERAGE(L16:N16),\"\"))))","v":0}]
[null,"Rental Income","Gross Land and Property",null,null,null,0.5,{"$f":"IF(ISERROR(SUM(D17:F17)/COUNTA(D17:F17)),0,SUM(D17:F17)/COUNTA(D17:F17)*G17)","v":0},null,"Rental Income","Gross Land and Property",null,null,null,0.5,{"$f":"IF(ISERROR(SUM(L17:N17)/COUNTA(L17:N17)),0,SUM(L17:N17)/COUNTA(L17:N17)*O17)","v":0}]
[null,null,"Net Land and Property",null,null,null,0.5,{"$f":"IF(ISERROR(SUM(D18:F18)/COUNTA(D18:F18)),0,SUM((D18:F18)/COUNTA(D18:F18))*G18)","v":0},null,null,"Net Land and Property",null,null,null,0.5,{"$f":"IF(ISERROR(SUM(L18:N18)/COUNTA(L18:N18)),0,SUM((L18:N18)/COUNTA(L18:N18))*O18)","v":0}]
[null,"Retired (Monthly)",null,1,2,"3 (latest)","Weighting","Amount Used",null,"Retired (Monthly)",null,{"$f":"D19","v":1},{"$f":"E19","v":2},{"$f":"F19","v":"3 (latest)"},"Weighting","Amount Used"]
[null,"State","State Pension",null,null,null,1,{"$f":"IF(ISERROR(SUM(D20:F20)/COUNTA(D20:F20)),0,SUM(D20:F20)/COUNTA(D20:F20)*G20)","v":0},null,"State","State Pension",null,null,null,1,{"$f":"IF(ISERROR(SUM(L20:N20)/COUNTA(L20:N20)),0,SUM(L20:N20)/COUNTA(L20:N20)*O20)","v":0}]
[null,"Private Pension 1","PP1 Gross",null,null,null,1,{"$f":"IF(ISERROR(SUM(D21:F21)/COUNTA(D21:F21)),0,SUM(D21:F21)/COUNTA(D21:F21)*G21)","v":0},null,"Private Pension 1","PP1 Gross",null,null,null,1,0]
[null,null,"PP 1 Net",null,null,null,1,{"$f":"IF(ISERROR(SUM(D22:F22)/COUNTA(D22:F22)),0,SUM(D22:F22)/COUNTA(D22:F22)*G22)","v":0},null,null,"PP 1 Net",null,null,null,1,0]
[null,"Private Pension 2","PP 2 Gross",null,null,null,1,{"$f":"IF(ISERROR(SUM(D23:F23)/COUNTA(D23:F23)),0,SUM(D23:F23)/COUNTA(D23:F23)*G23)","v":0},null,"Private Pension 2","PP 2 Gross",null,null,null,1,0]
[null,null,"PP 2 Net",null,null,null,1,{"$f":"IF(ISERROR(SUM(D24:F24)/COUNTA(D24:F24)),0,SUM(D24:F24)/COUNTA(D24:F24)*G24)","v":0},null,null,"PP 2 Net",null,null,null,1,0]
[null,"Private Pension 3","PP 3 Gross",null,null,null,1,0,null,"Private Pension 3","PP 3 Gross",null,null,null,1,0]
[null,null,"PP 4 Net",null,null,null,1,0,null,null,"PP 4 Net",null,null,null,1,0]
[null,"Benefits/Maintenance (Monthly)",null,1,2,{"$f":"F5","v":"3 (latest)"},"Weighting","Amount Used",null,"Benefits/Maintenance (Monthly)",null,{"$f":"D27","v":1},{"$f":"E27","v":2},{"$f":"F27","v":"3 (latest)"},"Weighting","Amount Used"]
[null,"Item 1",null,null,null,null,1,{"$f":"IF(ISERROR(SUM(D28:F28)/COUNTA(D28:F28)),0,SUM(D28:F28)/COUNTA(D28:F28)*G28)","v":0},null,"Item 1",null,null,null,null,1,{"$f":"IF(ISERROR(SUM(L28:N28)/COUNTA(L28:N28)),0,SUM(L28:N28)/COUNTA(L28:N28)*O28)","v":0}]
[null,"Item 2",null,null,null,null,1,{"$f":"IF(ISERROR(SUM(D29:F29)/COUNTA(D29:F29)),0,SUM(D29:F29)/COUNTA(D29:F29)*G29)","v":0},null,"Item 2",null,null,null,null,1,{"$f":"IF(ISERROR(SUM(L29:N29)/COUNTA(L29:N29)),0,SUM(L29:N29)/COUNTA(L29:N29)*O29)","v":0}]
[null,"Total Annual Gross Pay - Applicant 1",null,null,null,null,null,{"$f":"SUM((H6*12),(H8*12),H11,H13,H15,H17,(H20*12),(H21*12),(H23*12),(H25*12),(H28*12),(H29*12))","v":0},null,"Total Annual Gross Pay - Applicant 2",null,null,null,null,null,{"$f":"SUM((P6*12),(P8*12),P11,P13,P15,P17,(P20*12),(P21*12),(P23*12),(P25*12),(P28*12),(P29*12))","v":0}]
[null,"Total Annual Net Pay - Applicant 1",null,null,null,null,null,{"$f":"SUM((H7*12),(H9*12),H12,H14,H16,H18,(H20*12),(H22*12),(H24*12),(H26*12),(H28*12),(H29*12))","v":0},null,"Total Annual Net Pay - Applicant 2",null,null,null,null,null,{"$f":"SUM((P7*12),(P9*12),P12,P14,P16,P18,(P20*12),(P22*12),(P24*12),(P26*12),(P28*12),(P29*12))","v":0}]
[]
[null,"Year to data pay calculation",null,"Year to Date Pay",null,"Period","Average Pay",null,null,"Year to data pay calculation",null,"Year to Date Pay",null,"Period","Average Pay"]
[null,null,null,null,null,null,{"$f":"IF(D34=\"\",\"\",D34/F34)","v":""},null,null,null,null,null,null,null,{"$f":"IF(L34=\"\",\"\",L34/N34)","v":""}]
[]
[null,"Applicant 3",null,null,null,null,null,null,null,"Applicant 4"]
[null,"Employed (Monthly)",null,1,2,"3 (latest)","Weighting","Amount Used",null,"Employed (Monthly)",null,1,2,"3 (latest)","Weighting","Amount Used"]
[null,"Basic Pay","Gross Monthly Basic",null,null,null,1,{"$f":"IF(ISERROR(AVERAGE(D38:F38)),0,AVERAGE(D38:F38))","v":0},null,"Basic Pay","Gross Monthly Basic",null,null,null,1,{"$f":"IF(ISERROR(AVERAGE(L38:N38)),0,AVERAGE(L38:N38))","v":0}]
[null,null,"Net Monthly Basic",null,null,null,1,{"$f":"IF(ISERROR(AVERAGE(D39:F39)),0,AVERAGE(D39:F39))","v":0},null,null,"Net Monthly Basic",null,null,null,1,{"$f":"IF(ISERROR(AVERAGE(L39:N39)),0,AVERAGE(L39:N39))","v":0}]
[null,"Overtime","Gross Overtime",null,null,null,0.5,{"$f":"IF(ISERROR(AVERAGE(D40:F40)),0,AVERAGE(D40:F40))*G40","v":0},null,"Overtime","Gross Overtime",null,null,null,0.5,{"$f":"IF(ISERROR(AVERAGE(L40:N40)),0,AVERAGE(L40:N40))*O40","v":0}]
[null,null,"Net Monthly O/T",null,null,null,0.5,{"$f":"IF(ISERROR(AVERAGE(D41:F41)),0,AVERAGE(D41:F41))*G41","v":0},null,null,"Net Monthly O/T",null,null,null,0.5,{"$f":"IF(ISERROR(AVERAGE(L41:N41)),0,AVERAGE(L41:N41))*O41","v":0}]
[null,"Self-Employed (Annual)",null,1,2,"3 (latest)","AVG","Amount Used",null,"Self-Employed (Annual)",null,1,2,"3 (latest)","AVG","Amount Used"]
[null,"Net Profit","Gross Net Profit",null,null,null,2,{"$f":"IF(F43=\"\",0,IF(G43=1,F43,IF(G43=2,AVERAGE(E43:F43),IF(G43=3,AVERAGE(D43:F43),\"\"))))","v":0},null,"Net Profit","Gross Net Profit",null,null,null,2,{"$f":"IF(N43=\"\",0,IF(O43=1,N43,IF(O43=2,AVERAGE(M43:N43),IF(O43=3,AVERAGE(L43:N43),\"\"))))","v":0}]
[null,null,"Net Profit After Tax",null,null,null,2,{"$f":"IF(F44=\"\",0,IF(G44=1,F44,IF(G44=2,AVERAGE(E44:F44),IF(G44=3,AVERAGE(D44:F44),\"0\"))))","v":0},null,null,"Net Profit After Tax",null,null,null,2,{"$f":"IF(N44=\"\",0,IF(O44=1,N44,IF(O44=2,AVERAGE(M44:N44),IF(O44=3,AVERAGE(L44:N44),\"0\"))))","v":0}]
[null,"Salary","Gross Salary",null,null,null,2,{"$f":"IF(F45=\"\",0,IF(G45=1,F45,IF(G45=2,AVERAGE(E45:F45),IF(G45=3,AVERAGE(D45:F45),\"\"))))","v":0},null,"Salary","Gross Salary",null,null,null,2,{"$f":"IF(N45=\"\",0,IF(O45=1,N45,IF(O45=2,AVERAGE(M45:N45),IF(O45=3,AVERAGE(L45:N45),\"\"))))","v":0}]
[null,null,"Net Salary",null,null,null,2,{"$f":"IF(F46=\"\",0,IF(G46=1,F46,IF(G46=2,AVERAGE(E46:F46),IF(G46=3,AVERAGE(D46:F46),\"\"))))","v":0},null,null,"Net Salary",null,null,null,2,{"$f":"IF(N46=\"\",0,IF(O46=1,N46,IF(O46=2,AVERAGE(M46:N46),IF(O46=3,AVERAGE(L46:N46),\"\"))))","v":0}]
[null,"Dividends","Gross Dividends",null,null,null,2,{"$f":"IF(F47=\"\",0,IF(G47=1,F47,IF(G47=2,AVERAGE(E47:F47),IF(G47=3,AVERAGE(D47:F47),\"\"))))","v":0},null,"Dividends","Gross Dividends",null,null,null,2,{"$f":"IF(N47=\"\",0,IF(O47=1,N47,IF(O47=2,AVERAGE(M47:N47),IF(O47=3,AVERAGE(L47:N47),\"\"))))","v":0}]
[null,null,"Net Dividends",null,null,null,2,{"$f":"IF(F48=\"\",0,IF(G48=1,F48,IF(G48=2,AVERAGE(E48:F48),IF(G48=3,AVERAGE(D48:F48),\"\"))))","v":0},null,null,"Net Dividends",null,null,null,2,{"$f":"IF(N48=\"\",0,IF(O48=1,N48,IF(O48=2,AVERAGE(M48:N48),IF(O48=3,AVERAGE(L48:N48),\"\"))))","v":0}]
[null,"Rental Income","Gross Land and Property",null,null,null,0.5,{"$f":"IF(ISERROR(SUM(D49:F49)/COUNTA(D49:F49)),0,SUM(D49:F49)/COUNTA(D49:F49)*G49)","v":0},null,"Rental Income","Gross Land and Property",null,null,null,0.5,{"$f":"IF(ISERROR(SUM(L49:N49)/COUNTA(L49:N49)),0,SUM(L49:N49)/COUNTA(L49:N49)*O49)","v":0}]
[null,null,"Net Land and Property",null,null,null,0.5,{"$f":"IF(ISERROR(SUM(D50:F50)/COUNTA(D50:F50)),0,SUM((D50:F50)/COUNTA(D50:F50))*G50)","v":0},null,null,"Net Land and Property",null,null,null,0.5,{"$f":"IF(ISERROR(SUM(L50:N50)/COUNTA(L50:N50)),0,SUM((L50:N50)/COUNTA(L50:N50))*O50)","v":0}]
[null,"Retired (Monthly)",null,{"$f":"D19","v":1},{"$f":"E19","v":2},{"$f":"F19","v":"3 (latest)"},"Weighting","Amount Used",null,"Retired (Monthly)",null,1,2,"3 (latest)","Weighting","Amount Used"]
[null,"State","State Pension",null,null,null,1,{"$f":"IF(ISERROR(SUM(D52:F52)/COUNTA(D52:F52)),0,SUM(D52:F52)/COUNTA(D52:F52)*G52)","v":0},null,"State","State Pension",null,null,null,1,{"$f":"IF(ISERROR(SUM(L52:N52)/COUNTA(L52:N52)),0,SUM(L52:N52)/COUNTA(L52:N52)*O52)","v":0}]
[null,"Private Pension 1","PP1 Gross",null,null,null,1,0,null,"Private Pension 1","PP1 Gross",null,null,null,1,0]
[null,null,"PP 1 Net",null,null,null,1,0,null,null,"PP 1 Net",null,null,null,1,0]
[null,"Private Pension 2","PP 2 Gross",null,null,null,1,0,null,"Private Pension 2","PP 2 Gross",null,null,null,1,0]
[null,null,"PP 2 Net",null,null,null,1,0,null,null,"PP 2 Net",null,null,null,1,0]
[null,"Private Pension 3","PP 3 Gross",null,null,null,1,0,null,"Private Pension 3","PP 3 Gross",null,null,null,1,0]
[null,null,"PP 4 Net",null,null,null,1,0,null,null,"PP 4 Net",null,null,null,1,0]
[null,"Benefits/Maintenance (Monthly)",null,{"$f":"D27","v":1},{"$f":"E27","v":2},{"$f":"F27","v":"3 (latest)"},"Weighting","Amount Used",null,"Benefits/Maintenance (Monthly)",null,1,2,"3 (latest)","Weighting","Amount Used"]
[null,"Item 1",null,null,null,null,1,{"$f":"IF(ISERROR(SUM(D60:F60)/COUNTA(D60:F60)),0,SUM(D60:F60)/COUNTA(D60:F60)*G60)","v":0},null,"Item 1",null,null,null,null,1,{"$f":"IF(ISERROR(SUM(L60:N60)/COUNTA(L60:N60)),0,SUM(L60:N60)/COUNTA(L60:N60)*O60)","v":0}]
[null,"Item 2",null,null,null,null,1,{"$f":"IF(ISERROR(SUM(D61:F61)/COUNTA(D61:F61)),0,SUM(D61:F61)/COUNTA(D61:F61)*G61)","v":0},null,"Item 2",null,null,null,null,1,{"$f":"IF(ISERROR(SUM(L61:N61)/COUNTA(L61:N61)),0,SUM(L61:N61)/COUNTA(L61:N61)*O61)","v":0}]
[null,"Total Annual Gross Pay - Applicant 3",null,null,null,null,null,{"$f":"SUM((H38*12),(H40*12),H43,H45,H47,H49,(H52*12),(H53*12),(H55*12),(H57*12),(H60*12),(H61*12))","v":0},null,"Total Annual Gross Pay - Applicant 4",null,null,null,null,null,{"$f":"SUM((P38*12),(P40*12),P43,P45,P47,P49,(P52*12),(P53*12),(P55*12),(P57*12),(P60*12),(P61*12))","v":0}]
[null,"Total Annual Net Pay - Applicant 3",null,null,null,null,null,{"$f":"SUM((H39*12),(H41*12),H44,H46,H48,H50,(H52*12),(H54*12),(H56*12),(H58*12),(H60*12),(H61*12))","v":0},null,"Total Annual Net Pay - Applicant 4",null,null,null,null,null,{"$f":"SUM((P39*12),(P41*12),P44,P46,P48,P50,(P52*12),(P54*12),(P56*12),(P58*12),(P60*12),(P61*12))","v":0}]
[]
[null,"Year to data pay calculation",null,"Year to Date Pay",null,"Period","Average Pay",null,null,"Year to data pay calculation",null,"Year to Date Pay",null,"Period","Average Pay"]
[null,null,null,null,null,null,{"$f":"IF(D66=\"\",\"\",D66/F66)","v":""},null,null,null,null,null,null,null,{"$f":"IF(L66=\"\",\"\",L66/N66)","v":""}]

{"sheet":"3 - Debt","index":6,"n_rows":33,"n_cols":13,"rows_kept":33,"cut":false,"hidden":true,"merged":[[31,2,31,4],[32,2,32,4],[35,2,35,4],[25,2,25,5],[2,11,2,12],[27,2,27,4],[28,2,28,4],[29,2,29,4],[30,2,30,4]]}
[null,null,"Credit Commitments"]
[]
[1,null,"App No","Company","Credit Type","Balance","Payment","To Be Used","Include","Justification",null,"Total to be included"]
[2,null,null,null,null,null,null,{"$f":"IF(E4=\"Credit Card\",F4*3%,G4)","v":0},null,null,null,"App 1",{"$f":"SUMIFS(H:H,C:C,A3,I:I,\"Yes\")","v":0}]
[3,null,null,null,null,null,null,{"$f":"IF(E5=\"Credit Card\",F5*3%,G5)","v":0},null,null,null,"App 2 ",{"$f":"SUMIFS(H:H,C:C,A4,I:I,\"Yes\")","v":0}]
[4,null,null,null,null,null,null,0,null,null,null,"App 3",{"$f":"SUMIFS(H:H,C:C,A5,I:I,\"Yes\")","v":0}]
[null,null,null,null,null,null,null,0,null,null,null,"App 4",{"$f":"SUMIFS(H:H,C:C,A6,I:I,\"Yes\")","v":0}]
[null,null,null,null,null,null,null,0]
["Unsecured Loan",null,null,null,null,null,null,0,null,null,null,"Total",{"$f":"SUM(M4:M7)","v":0}]
["Hire Purchase",null,null,null,null,null,null,0]
["Credit Card",null,null,null,null,null,null,0]
["Catalogue",null,null,null,null,null,null,0]
["Short Term Credit",null,null,null,null,null,null,0]
["ICR Contingency",null,null,null,null,null,null,0]
[null,null,null,null,null,null,null,0]
[null,null,null,null,null,null,null,0]
["Yes",null,null,null,null,null,null,0]
["No",null,null,null,null,null,null,0]
[null,null,null,null,null,null,null,0]
[null,null,null,null,null,null,null,0]
[null,null,null,null,null,null,null,0]
[null,null,null,null,null,null,null,0]
[null,null,null,null,null,null,null,0]
[null,null,null,null,null,null,null,0]
[]
[null,null,"Stressed Mortgage Payment Calculator"]
[]
[null,null,"Mortgage Amount £"]
[null,null,"Repayment Type"]
[null,null,"Remaining Term (years)"]
[null,null,"Stressed Rate"]
[null,null,"Monthly Repayment Factor",null,null,{"$f":"-PMT(F31/100,F30,1000)/12","v":{"$error":"#NUM!"}}]
[null,null,"Stressed Payment",null,null,{"$f":"IFERROR(IF(F29=\"Interest Only\",(F28*F31/1200),(F28/1000*F32)),\"\")","v":""}]

{"sheet":"4 - Expenditure","index":7,"n_rows":26,"n_cols":16,"rows_kept":26,"cut":false,"hidden":true,"merged":[[25,1,25,8],[0,1,0,4]]}
[null,"Expenditure\nFigures input into 'Underwriter confirmed'  column used against ONS",null,null,null,null,null,null,null,null,null,null,null,null,null,"Adviser Input (Level 1 - 2)"]
[null,null,null,null,null,null,null,null,null,null,null,null,null,null,null,"Bank Statement Verified (Level 3 - 4)"]
[null,"Items","Application input","Month 1","Month 2","Month 3","Underwriter Confirmed","Source","ONS","Final Value","Value Used","Justification",null,null,null,"Other - Stated in rationale"]
[null,"Council Tax",null,null,null,null,null,null,0,{"$f":"G4*110%","v":0},{"$f":"IF(H4=\"\",\"\",IFERROR(IF(J4=0,\"\",IF(J4=I4,\"ONS\",H4)),\"\"))","v":""}]
[null,"Ground Rent/Service Charge",null,null,null,null,null,null,null,{"$f":"G5","v":0},{"$f":"IF(H5=\"\",\"\",IFERROR(IF(J5=0,\"\",IF(J5=I5,\"ONS\",H5)),\"\"))","v":""}]
[null,"Utility Total",null,null,null,null,null,null,{"$f":"'1 - Main'!P38","v":""},{"$f":"MAX(G6:I6)","v":0},""]
[null,"Food/Groceries",null,null,null,null,null,null,{"$f":"'1 - Main'!P39","v":""},0,""]
[null,"Essential Travel",null,null,null,null,null,null,{"$f":"'1 - Main'!P40","v":""},0,""]
[null,"Essential Insurance",null,null,null,null,null,null,{"$f":"'1 - Main'!P41","v":""},0,""]
[null,"Telephone/ TV/ Satellite",null,null,null,null,null,null,{"$f":"'1 - Main'!P42","v":""},0,""]
[null,"Childcare",null,null,null,null,null,null,{"$f":"'1 - Main'!P43","v":0},{"$f":"G11","v":0},""]
[null,"Clothing/Footwear",null,null,null,null,null,null,{"$f":"'1 - Main'!P44","v":""},0,""]
[null,"Other",null,null,null,null,null,null,{"$f":"'1 - Main'!P46","v":""},{"$f":"'1 - Main'!Q46","v":""},{"$f":"IF(H13=\"\",\"\",IFERROR(IF(J13=0,\"\",IF(J13=I13,\"ONS\",H13)),\"\"))","v":""}]
[]
[null,"Other Items (non-specific)","Application input",{"$f":"D3","v":"Month 1"},{"$f":"E3","v":"Month 2"},{"$f":"F3","v":"Month 3"},"Underwriter Confirmed","Source","ONS","Final Value",null,"Justification"]
[null,null,null,null,null,null,null,null,null,{"$f":"G16","v":0},{"$f":"IF(J16=0,\"\",IF(J16=I16,\"ONS\",H16))","v":""}]
[null,null,null,null,null,null,null,null,null,0,""]
[null,null,null,null,null,null,null,null,null,0,""]
[null,null,null,null,null,null,null,null,null,0,""]
[null,null,null,null,null,null,null,null,null,0,""]
[null,null,null,null,null,null,null,null,null,0,""]
[null,null,null,null,null,null,null,null,null,0,""]
[null,null,null,null,null,null,null,null,null,0,""]
[null,"Total Other",null,null,null,null,null,null,0,{"$f":"SUM(J16:J23)","v":0}]
[]
[null,"Total Expenditure",null,null,null,null,null,null,null,{"$f":"SUM(J4:J13)+J24","v":0}]

{"sheet":"5 - Notes","index":8,"n_rows":18,"n_cols":14,"rows_kept":18,"cut":false,"hidden":true,"merged":[[0,0,0,6]]}
["BTL in Background"]
[]
[null,"Total Mortgage Debt £","Stressed interest rate","Total Annual Rental Income","Stressed Mortgage payment (D)","Surplus (shortfall) C-D","ICR"]
["1. Single Residential Units (personal basic rate tax payer or Ltd Co)",null,null,null,{"$f":"ROUND(+B4*C4,0)","v":0},{"$f":"D4-E4","v":0},{"$f":"IFERROR(D4/E4,\"\")","v":""},null,"1. Stressed payment total",{"$f":"E4","v":0},"2. Stressed payment total",{"$f":"E5","v":0},"3. Stressed payment total",{"$f":"E6","v":0}]
["2. Single Residential Units (personal higher rate tax payer)",null,null,null,0,0,"",null,"125% of stressed payment",{"$f":"J4*1.25","v":0},"140% of stressed payment",{"$f":"L4*1.4","v":0},"145% of stressed payment",{"$f":"N4*1.45","v":0}]
["3. Holiday Let",null,null,null,{"$f":"ROUND(+B6*C6,0)","v":0},{"$f":"D6-E6","v":0},{"$f":"IFERROR(D6/E6,\"\")","v":""},null,"Rent",{"$f":"D4","v":0},"Rent",{"$f":"D5","v":0},"Rent",{"$f":"D6","v":0}]
["4. HMOs (personal basic rate tax payer or Ltd Co)",null,null,null,0,0,"",null,"Surplus/Shortfall PA",{"$f":"J6-J5","v":0},"Surplus/Shortfall PA",{"$f":"L6-L5","v":0},"Surplus/Shortfall PA",{"$f":"N6-N5","v":0}]
["5. HMOs (higher rate tax payer)",null,null,null,0,0,"",null,"Surplus/Shortfall PCM",{"$f":"J7/12","v":0},"Surplus/Shortfall PCM",{"$f":"L7/12","v":0},"Surplus/Shortfall PCM",{"$f":"N7/12","v":0}]
[null,null,null,null,0,0,""]
[null,null,null,null,0,0,"",null,"4. Stressed payment total",{"$f":"E7","v":0},"5. Stressed payment total",{"$f":"E8","v":0}]
[null,null,null,null,0,0,"",null,"150% of stressed payment",{"$f":"J10*1.5","v":0},"165% of stressed payment",{"$f":"L10*1.65","v":0}]
[null,null,null,null,0,0,"",null,"Rent",{"$f":"D7","v":0},"Rent",{"$f":"D8","v":0}]
[null,null,null,null,0,0,"",null,"Surplus/Shortfall PA",{"$f":"J12-J11","v":0},"Surplus/Shortfall PA",{"$f":"L12-L11","v":0}]
[null,null,null,null,0,0,"",null,"Surplus/Shortfall PCM",{"$f":"J13/12","v":0},"Surplus/Shortfall PCM",{"$f":"L13/12","v":0}]
[]
["Total",{"$f":"SUM(B4:B14)","v":0},{"$f":"IFERROR(AVERAGEIF(B4:B14,\">0\",C4:C14),0)","v":0},{"$f":"SUM(D4:D14)","v":0},{"$f":"SUM(E4:E14)","v":0},{"$f":"SUM(F4:F14)","v":0},{"$f":"IFERROR(D16/E16,\"\")","v":""},null,null,null,"Total Suplus/Shortfall PCM",{"$f":"SUM(J8+L8+N8+J14+L14)","v":0}]
[]
["Notes"]

{"sheet":" VBS Criteria","index":9,"n_rows":63,"n_cols":16,"rows_kept":63,"cut":false,"hidden":true,"merged":[[4,3,5,13],[8,14,8,15]]}
["VBS criteria set in model",null,null,null,"list","Broker"]
[null,null,null,null,null,"Direct"]
[]
["Minimum excess income required",0.05]
["Rate payable based on SVR",7.7,"%"]
["Amount stressed (additional margin applied)",1,"%"]
["Non Standard income % used ",0.5]
["Income Multiple cap for max loan amount -  standard ",4.5]
["Income Multiple cap for max loan amount -  upper limit",5,null,null,null,"Affordability Breakdown (1 - Main)",null,null,"Max Loan Calculation",null,null,"Broker Affordability (Broker)",null,null,"ONS Figures Used"]
["Minimum loan amount",25000]
["Passwords",null,null,null,null,"Loan Amount",{"$f":"IF(G15='Drop down'!C4,SUM('1 - Main'!F14,'1 - Main'!K14:L14),'1 - Main'!F12)","v":0},null,"Max Capital & Interest loan -Highest of Own and ONS",{"$f":"ROUNDUP(IF(G28>0,G28/G35*1000,0),0)","v":0},null,"Loan Amount",{"$f":"IF(Broker!F17=\"Part & Part\",Broker!F21+Broker!J21,Broker!F19)","v":0},null,"Home Fuel & Utility Bills",{"$f":"IFERROR(HLOOKUP(M19,'ONS Update'!$C$5:$J$17,5,FALSE),\"\")","v":""}]
["Tabs 1 - 5","Vern0n",null,null,null,"Property Value",{"$f":"'1 - Main'!F16","v":0},null,"90% of Max Capital & Interest loan / 85% Five Year Product",{"$f":"IF(B32<>\"Standard\",J11*85%,J11*90%)","v":0},null,"Property Value",{"$f":"Broker!F23","v":0},null,"Food, groceries, toiletries and cleaning products",{"$f":"IFERROR(HLOOKUP(M19,'ONS Update'!$C$5:$J$17,2,FALSE)+(HLOOKUP(M19,'ONS Update'!$C$5:$J$17,6,FALSE)*50%)+(HLOOKUP(M19,'ONS Update'!$C$5:$J$17,13,FALSE)*31%),\"\")","v":""}]
["Mort repay","repay",null,null,null,"Term",{"$f":"'1 - Main'!F18","v":0},null,"95% of Max Capital & Interest loan - higher of own and ONS",{"$f":"J11*0.95","v":0},null,"Term",{"$f":"Broker!F25","v":0},null,"Essential Travel Costs (exclude car insurance)",{"$f":"IFERROR(HLOOKUP(M19,'ONS Update'!$C$5:$J$17,8,FALSE),\"\")","v":""}]
["dropdown ","DD",null,null,null,"LTV",{"$f":"'1 - Main'!H16","v":""},null,"Max 'capped' loan standard 4.5x",{"$f":"G20*B8","v":0},null,"LTV",{"$f":"IFERROR((M11/M12)*100,0)","v":0},null,"Essential Insurances (include car insurance if applicable)",{"$f":"IFERROR(HLOOKUP(M19,'ONS Update'!$C$5:$J$17,13,FALSE)*69%,\"\")","v":""}]
["version control","control",null,null,null,"Repayment Method",{"$f":"'1 - Main'!F10","v":0},null,"Max 'capped' loan upper limit",{"$f":"G20*B9","v":0},null,"Repayment Method",{"$f":"Broker!F17","v":0},null,"Telephones / Internet / TV and Satellite costs",{"$f":"IFERROR(HLOOKUP(M19,'ONS Update'!$C$5:$J$17,9,FALSE)+(HLOOKUP(M19,'ONS Update'!$C$5:$J$17,10,FALSE)*35%),\"\")","v":""}]
["UW Detail input (calc)","uwinput",null,null,null,"Applicants",{"$f":"'1 - Main'!F20","v":0},null,"Monthly Repayment Capital Repayment",{"$f":"(' VBS Criteria'!G11/1000)*' VBS Criteria'!G35","v":{"$error":"#NUM!"}},null,"Applicants",{"$f":"Broker!D13","v":0},null,"Clothing and Footwear",{"$f":"IFERROR(HLOOKUP(M19,'ONS Update'!$C$5:$J$17,4,FALSE),\"\")","v":""}]
["input calculation  assist","assist",null,null,null,"Number of Adults",{"$f":"VLOOKUP('1 - Main'!F22,'Drop down'!$G$2:$H$3,2,FALSE)","v":{"$error":"#N/A"}},null,"C&I Lower of max affordable loan or standard LTI",{"$f":"IF(J11<=J14,J11,J14)","v":0},null,"Number of Adults",{"$f":"VLOOKUP(Broker!$H$13,'Drop down'!$G$2:$H$3,2,FALSE)","v":{"$error":"#N/A"}},null,"Higher of ONS Miscellaneous Expenditure or 5% of Income",{"$f":"MAX(M22*5%,IFERROR(HLOOKUP(M19,'ONS Update'!$C$5:$J$17,3,FALSE)+(HLOOKUP(M19,'ONS Update'!$C$5:$J$17,6,FALSE)*50%)+HLOOKUP(M19,'ONS Update'!$C$5:$J$17,7,FALSE)+(HLOOKUP(M19,'ONS Update'!$C$5:$J$17,10,FALSE)*65%)+HLOOKUP(M19,'ONS Update'!$C$5:$J$17,11,FALSE),\"\"))","v":{"$error":"#VALUE!"}}]
["VBS Criteria","criteria",null,null,null,"Number of Dependent Children",{"$f":"VLOOKUP('1 - Main'!F24,'Drop down'!E2:F5,2,FALSE)","v":0},null,"C&I Lower of 90% of affordable loan or upper LTI",{"$f":"IF(J12<J15,J12,J15)","v":0},null,"Number of Dependent Children",{"$f":"VLOOKUP(Broker!$L$13,'Drop down'!$E$2:$F$5,2,FALSE)","v":0}]
["ONS","ONS",null,null,null,"Adult + Children Score",{"$f":"SUM(G17:G18)","v":{"$error":"#N/A"}},null,"C&I Max loan offered",{"$f":"IF(J17>=J18,J17,J18)","v":0},null,"Adult + Children Score",{"$f":"SUM(M17:M18)","v":{"$error":"#N/A"}},null,"Max Loan Calculation"]
["ONS table A23","A23",null,null,null,"Gross Income",{"$f":"SUM('1 - Main'!F29:L29)","v":0}]
["ONS breakdown A1","A1",null,null,null,"Total Net Monthly Income",{"$f":"SUM('1 - Main'!F31:L31)","v":0},null,"Interest-Only Max Calculation",null,null,"Gross Income",{"$f":"SUM(Broker!F29,Broker!L29,Broker!F36,Broker!L36)","v":0},null,"Max Capital & Interest loan -Highest of Own and ONS",{"$f":"ROUNDUP(IF(M29>0,M29/M34*1000,0),0)","v":{"$error":"#VALUE!"}}]
["Broker","Vern0n",null,null,null,"Interest-Only",{"$f":"IF(ISNUMBER(SEARCH(\"Only\",G15)),\"Yes\",\"No\")","v":"No"},null,"Max interest only loan -Highest of own and ONS",{"$f":"ROUNDUP(IF(G28>0,+(G28*12)/(G33/100),0),0)","v":0},null,"Usable Net Income",{"$f":"SUM(Broker!F35,Broker!L35,Broker!F42,Broker!L42)","v":0},null,"90% of Max Capital & Interest loan - higher of own and ONS",{"$f":"IF(C32<>\"Standard\",P21*85%,P21*90%)","v":{"$error":"#VALUE!"}}]
[null,null,null,null,null,"Part & Part",{"$f":"IF(ISNUMBER(SEARCH(\"Part\",G15)),\"Yes\",\"No\")","v":"No"},null,"90% of Max int only loan / 85% ",{"$f":"IF(B32<>\"Standard\",J22*85%,J22*90%)","v":0},null,null,null,null,"Max 'capped' loan standard 4.5x",{"$f":"M21*4.5","v":0}]
[null,null,null,null,null,"Unsecured Credit Commitments",{"$f":"SUM('1 - Main'!F33:L33)","v":0},null,"95% of Max int only loan - higher of own and ONS",{"$f":"J22*0.95","v":0},null,"ONS Total",{"$f":"SUM(P11:P17)","v":{"$error":"#VALUE!"}},null,"Max 'capped' loan upper limit",{"$f":"M21*B9","v":0}]
[null,null,null,null,null,"Essential Expenditure",{"$f":"SUM('1 - Main'!Q36:Q46)","v":0},null,"Max 'capped' loan standard 4.5x",{"$f":"J14","v":0},null,"Council tax",{"$f":"IF(M17=1,VLOOKUP(Broker!F23,'Council Tax Bands UK'!N:Q,4)*0.75,VLOOKUP(Broker!F23,'Council Tax Bands UK'!N:Q,4))","v":{"$error":"#N/A"}},null,"Monthly Repayment Capital Repayment",{"$f":"(M11/1000)*M34","v":{"$error":"#NUM!"}}]
["Stressed Rate",null,null,null,null,"Income Multiple",{"$f":"G11/G20","v":{"$error":"#DIV/0!"}},null,"Monthly Interest-only payment",{"$f":"G11/12*G33/100","v":0},null,"Declared Expenditure",{"$f":"SUM(Broker!F50,Broker!L50,Broker!F56,Broker!L56)","v":0},null,"C&I Lower of max affordable loan or standard LTI",{"$f":"IF(P21<=P23,P21,P23)","v":{"$error":"#VALUE!"}}]
[null,"1 - Main","Broker",null,null,"Total Expenditure",{"$f":"G24+G25","v":0},null,"I/O Lower of max affordable loan or standard LTI",{"$f":"IF(J14<=J22,J14,J22)","v":0},null,"Total Expenditure",{"$f":"SUM(M24:M26)","v":{"$error":"#VALUE!"}},null,"C&I Lower of 90% of affordable loan or upper LTI",{"$f":"IF(P22<P24,P22,P24)","v":{"$error":"#VALUE!"}}]
["Standard",8.6999999999999993,{"$f":"B28","v":8.6999999999999993},null,null,"Amount Available for Mortgage Payment",{"$f":"G21-G27","v":0},null,"I/O Max loan offered",{"$f":"J27","v":0},null,null,null,null,"C&I Max loan offered",{"$f":"IF(P26>=P27,P26,P27)","v":{"$error":"#VALUE!"}}]
["Product Rate",{"$f":"'1 - Main'!F8*100","v":0},{"$f":"Broker!H11*100","v":0},null,null,null,null,null,null,null,null,"Amount Available for Mortgage Payment",{"$f":"M22-M27","v":{"$error":"#VALUE!"}}]
["Rounded Product Rate",{"$f":"CEILING(B29,0.05)","v":0},{"$f":"CEILING(C29,0.05)","v":0},null,null,"Affordability Basis",null,null,"Part & Part Max Loan Calculation",null,null,null,null,null,"Interest-Only Max Calculation"]
["Five Year Fixed?",{"$f":"IF(ISNUMBER(SEARCH(5,'1 - Main'!F6)),\"Yes\",\"No\")","v":"No"},{"$f":"M31","v":"No"},null,null,"5 Year Product?",{"$f":"IF(ISNUMBER(SEARCH(5,'1 - Main'!F6)),\"Yes\",\"No\")","v":"No"},null,"Capital Repayment Amount",{"$f":"'1 - Main'!F14","v":0},null,"5 Year Product?",{"$f":"IF(ISNUMBER(SEARCH(5,Broker!D11)),\"Yes\",\"No\")","v":"No"},null,"Max interest only loan -Highest of own and ONS",{"$f":"ROUNDUP(IF(M29>0,+(M29*12)/(M33/100),0),0)","v":{"$error":"#VALUE!"}}]
["Product Type",{"$f":"IF(ISNUMBER(SEARCH(\"Discount\",'1 - Main'!F6)),\"Discount\",IF(ISNUMBER(SEARCH(\"Fixed\",'1 - Main'!F6)),\"Fixed\",\"Standard\"))","v":"Standard"},{"$f":"M32","v":"Standard"},null,null,"Product Type",{"$f":"IF(ISNUMBER(SEARCH(\"Discount\",'1 - Main'!F6)),\"Discount\",IF(ISNUMBER(SEARCH(\"Fixed\",'1 - Main'!F6)),\"Fixed\",\"Standard\"))","v":"Standard"},null,"Interest-Only Amount",{"$f":"'1 - Main'!K14","v":0},null,"Product Type",{"$f":"IF(ISNUMBER(SEARCH(\"Discount\",Broker!D11)),\"Discount\",IF(ISNUMBER(SEARCH(\"Fixed\",Broker!D11)),\"Fixed\",\"Standard\"))","v":"Standard"},null,"90% of Max int only loan - higher of own and ONS",{"$f":"IF(C32<>\"Standard\",P31*85%,P31*90%)","v":{"$error":"#VALUE!"}}]
[null,null,null,null,null,"Stressed Int rate",{"$f":"' VBS Criteria'!B43","v":8.6999999999999993},null,"Total Loan Amount",{"$f":"SUM(J31:J32)","v":0},null,"Stressed Int rate",{"$f":"C43","v":8.6999999999999993},null,"Max 'capped' loan standard 4.5x",{"$f":"P23","v":0}]
["Discounted Rate",null,null,null,null,"Rounded Product Rate",{"$f":"B30","v":0},null,"Interest-only Element Payment",{"$f":"J32/12*G33/100","v":0},null,"Monthly repay factor (stress)",{"$f":"-PMT(M33/100,M13,1000)/12","v":{"$error":"#NUM!"}},null,"Monthly Interest-only payment",{"$f":"M11/12*M33/100","v":0}]
["Cap - 5 Year Discount",4.7,{"$f":"B35","v":4.7},null,null,"Monthly repay factor (stress)",{"$f":"-PMT(G33/100,G13,1000)/12","v":{"$error":"#NUM!"}},null,"Capital * Interest Repayment",{"$f":"(J31/1000)*' VBS Criteria'!G35","v":{"$error":"#NUM!"}},null,null,null,null,"I/O Lower of max affordable loan or standard LTI",{"$f":"IF(P23<=P31,P23,P31)","v":{"$error":"#VALUE!"}}]
["Product Rate + 1%",{"$f":"B29+1","v":1},{"$f":"C29+1","v":1},null,null,"Product repay factor",{"$f":"-PMT(G34/100,G13,1000)/12","v":{"$error":"#NUM!"}},null,"Total Part & Part Payment",{"$f":"J34+J35","v":{"$error":"#NUM!"}},null,"Documentary Evidence Calculation",null,null,"I/O Max loan offered",{"$f":"P35","v":{"$error":"#VALUE!"}}]
["Discount Stressed Rate",{"$f":"IF(MAX(B35:B36)>B28,B28,MAX(B35:B36))","v":4.7},{"$f":"IF(MAX(C35:C36)>C28,C28,MAX(C35:C36))","v":4.7},null,null,null,null,null,"Amount Available for P&P Element",{"$f":"G28-J34","v":0},null,"LTV",{"$f":"VLOOKUP(M14,'Drop down'!O17:P21,2,TRUE)","v":1}]
[null,null,null,null,null,"Documentary Evidence Calculation",null,null,"Max Part & Part loan -Highest of Own and ONS",{"$f":"ROUNDUP(IF(J37>0,J37/G35*1000,0),0)+J32","v":0},null,"Affordability",{"$f":"IFERROR(IF(M50=\"Capital Repayment\",(VLOOKUP(M46,'Drop down'!Q17:R21,2,TRUE)),IF(M50=\"Interest-only\",(VLOOKUP(M47,'Drop down'!Q17:R21,2,TRUE)),IF(M50=\"Part & part\",VLOOKUP(M48,'Drop down'!Q17:R21,2,TRUE)))),1000)","v":1000},null,"Part & Part Max Loan Calculation"]
["Floor - 5 Year Fixed",2.75,{"$f":"B39","v":2.75},null,null,"LTV",{"$f":"VLOOKUP(G14,'Drop down'!O17:P21,2,TRUE)","v":{"$error":"#N/A"}},null,"90% of Max P&P loan - higher of own and ONS",{"$f":"IF(B32<>\"Standard\",J38*85%,J38*90%)","v":0},null,"LTV & affordability score",{"$f":"M37*M38","v":1000},null,"Capital Repayment Amount",{"$f":"Broker!F21","v":0}]
["Fixed Rate",{"$f":"IF(B32=\"Fixed\",B29,\"N/A\")","v":"N/A"},{"$f":"IF(C32=\"Fixed\",C29,\"N/A\")","v":"N/A"},null,null,"Affordability",{"$f":"IFERROR(IF(G15=\"Capital & Interest\",(VLOOKUP('1 - Main'!J78,'Drop down'!Q17:R21,2,TRUE)),IF(G15=\"Interest only\",(VLOOKUP('1 - Main'!J82,'Drop down'!Q17:R21,2,TRUE)),IF(' VBS Criteria'!G15=\"Part & part\",VLOOKUP('1 - Main'!J86,'Drop down'!Q17:R21,2,TRUE)))),1000)","v":false},null,"Max 'capped' loan standard 4.5x",{"$f":"J14","v":0},null,"Level",{"$f":"VLOOKUP(M39,'Drop down'!P25:Q28,2,TRUE)","v":"Level 4"},null,"Interest-Only Amount",{"$f":"Broker!J21","v":0}]
["Fixed Stressed Rate",{"$f":"MAX(B39:B40)","v":2.75},{"$f":"MAX(C39:C40)","v":2.75},null,null,"LTV & affordability score",{"$f":"G39*G40","v":{"$error":"#N/A"}},null,"Max 'capped' loan upper limit",{"$f":"J15","v":0},null,null,null,null,"Total Loan Amount",{"$f":"SUM(P39:P40)","v":0}]
[null,null,null,null,null,"Level",{"$f":"VLOOKUP(G41,'Drop down'!P25:Q28,2,TRUE)","v":{"$error":"#N/A"}},null,"P&P Lower of max affordable loan or standard LTI",{"$f":"IF(J38<=J40,J38,J40)","v":0},null,"Surplus Income on C&I",{"$f":"M29-P25","v":{"$error":"#VALUE!"}},null,"Interest-only Element Payment",{"$f":"P40/12*M33/100","v":0}]
["Stressed Rate to be used",{"$f":"IF(B29=0,B28,CEILING(IF(B31<>\"Yes\",B28,IF(B32=\"Fixed\",B41,IF(B32=\"Discount\",B37,0))),0.05))","v":8.6999999999999993},{"$f":"IF(C29=0,C28,CEILING(IF(C31<>\"Yes\",C28,IF(C32=\"Fixed\",C41,IF(C32=\"Discount\",C37,0))),0.05))","v":8.6999999999999993},null,null,null,null,null,"P&P Lower of 90% of affordable loan or upper LTI",{"$f":"IF(J39<J41,J39,J41)","v":0},null,"Surplus Income on I/O",{"$f":"M29-P34","v":{"$error":"#VALUE!"}},null,"Capital * Interest Repayment",{"$f":"(P39/1000)*M34","v":{"$error":"#NUM!"}}]
[null,null,null,null,null,"PEL Calculation",null,null,"P&P Max loan offered",{"$f":"IF(J42>J43,J42,J43)","v":0},null,"Surplus Income on P&P",{"$f":"M29-P44","v":{"$error":"#VALUE!"}},null,"Total Part & Part Payment",{"$f":"P42+P43","v":{"$error":"#NUM!"}}]
[null,null,null,null,null,"Credit Score 1",{"$f":"'1 - Main'!F27","v":0},null,null,null,null,null,null,null,"Amount Available for P&P Element",{"$f":"M29-P43","v":{"$error":"#VALUE!"}}]
[null,null,null,null,null,"Credit Score 2 ",{"$f":"'1 - Main'!H27","v":0},null,"Product Rate Payments",null,null,"Requested Loan as % of Max Loan (C&I)",{"$f":"(M29-P25)/M22","v":{"$error":"#VALUE!"}},null,"Max Part & Part loan -Highest of Own and ONS",{"$f":"ROUNDUP(IF(M29>0,M29/M34*1000,0),0)+P40","v":{"$error":"#VALUE!"}}]
[null,null,null,null,null,"Credit Score 3",{"$f":"'1 - Main'!J27","v":0},null,"Capital & Interest",{"$f":"(' VBS Criteria'!G11/1000)*G36","v":{"$error":"#NUM!"}},null,"Requested Loan as % of Max Loan (I/O)",{"$f":"(M29-P34)/M22","v":{"$error":"#VALUE!"}},null,"90% of Max P&P loan - higher of own and ONS",{"$f":"IF(C32<>\"Standard\",P46*85%,P46*90%)","v":{"$error":"#VALUE!"}}]
[null,null,null,null,null,"Credit Score 4",{"$f":"'1 - Main'!L27","v":0},null,"Interest-Only",{"$f":"G11/12*G34/100","v":0},null,"Requested Loan as % of Max Loan (P&P)",{"$f":"(M29-P44)/M22","v":{"$error":"#VALUE!"}},null,"Max 'capped' loan standard 4.5x",{"$f":"P23","v":0}]
[null,null,null,null,null,"Average Credit Score",{"$f":"IF(SUM(G45:G48)=0,0,AVERAGEIF(G45:G48,\">0\",G45:G48))","v":0},null,"Part & Part",{"$f":"(J32/12*G34/100)+((J31/1000)*G36)","v":{"$error":"#NUM!"}},null,null,null,null,"Max 'capped' loan upper limit",{"$f":"P24","v":0}]
[null,null,null,null,null,"Score PD",{"$f":"2^((500-G49)/20)/(1+2^((500-G49)/20))","v":0.9999999701976785},null,null,null,null,"Repayment Type",{"$f":"IF(ISNUMBER(SEARCH(\"Only\",M15)),\"Interest-Only\",IF(ISNUMBER(SEARCH(\"Part\",M15)),\"Part & Part\",\"Capital Repayment\"))","v":"Capital Repayment"},null,"P&P Lower of max affordable loan or standard LTI",{"$f":"IF(P46<=P48,P46,P48)","v":{"$error":"#VALUE!"}}]
[null,null,null,null,null,"Scalar PD",{"$f":"G50*PEL!$B$24","v":2.4999999254941963},null,"5% Buffer Cap",160,null,null,null,null,"P&P Lower of 90% of affordable loan or upper LTI",{"$f":"IF(P47<P49,P47,P49)","v":{"$error":"#VALUE!"}}]
[null,null,null,null,null,"Floored PD",{"$f":"IF(G51<PEL!B27,PEL!B27,' VBS Criteria'!G51)","v":2.4999999254941963},null,null,null,null,null,null,null,"P&P Max loan offered",{"$f":"IF(P50>P51,P50,P51)","v":{"$error":"#VALUE!"}}]
[null,null,null,null,null,"Valuation",{"$f":"G12","v":0}]
[null,null,null,null,null,"Forced Sale Valuation",{"$f":"G53*(1-PEL!B30)","v":0}]
[null,null,null,null,null,"Sales Costs",{"$f":"IF(G54*PEL!$B$31>PEL!$B$32,PEL!$B$32,G54*PEL!$B$31)","v":0}]
[null,null,null,null,null,"Advance plus costs",{"$f":"G11+G55","v":0}]
[null,null,null,null,null,"LGD",{"$f":"IF((G14>100)>50%,-MIN(PEL!$B$29*(G54-G56),-G56*PEL!B28),IF((PEL!$B$29*(G54-G56))>0,0,(PEL!$B$29*(G54-G56))))","v":0}]
[null,null,null,null,null,"Expected Loss (£)",{"$f":"G57*G52","v":0}]
[null,null,null,null,null,"Downturn Expected Loss (%)",{"$f":"G58/G11","v":{"$error":"#DIV/0!"}}]
[null,null,null,null,null,"WA EL(%)",{"$f":"G59*G11","v":{"$error":"#DIV/0!"}}]
[null,null,null,null,null,"LTV Band",{"$f":"VLOOKUP(G14/100,PEL!A14:C19,3)","v":{"$error":"#VALUE!"}}]
[null,null,null,null,null,"PEL Trigger",{"$f":"IF(G14/100<80%,PEL!C10,IF(AND(G14/100>=80%,G14/100<=90%),PEL!$C$8,IF(G14/100>90%,PEL!$C$9)))","v":{"$error":"#VALUE!"}}]
[null,null,null,null,null,"PEL>Trigger",{"$f":"IF(G59>G62,\"YES\",\"NO\")","v":{"$error":"#DIV/0!"}}]

{"sheet":"Guidance Notes","index":10,"n_rows":39,"n_cols":9,"rows_kept":39,"cut":false,"hidden":true,"merged":[[38,1,38,8],[6,1,6,2],[10,1,10,2],[10,3,10,8],[30,3,30,8],[30,1,30,2],[32,8,33,8],[15,1,15,2],[16,1,16,2],[17,1,17,2],[20,1,20,2],[21,1,21,2],[28,3,28,8],[24,3,24,8],[25,3,25,8],[16,3,16,8],[17,3,17,8],[20,3,20,8],[21,3,21,8],[22,3,22,8],[18,1,18,8],[22,1,22,2],[2,1,3,9],[4,1,4,2],[8,1,8,2],[9,1,9,2],[14,1,14,2],[13,1,13,2],[4,3,4,8],[5,3,5,8],[12,3,12,8],[7,1,7,2],[28,1,28,2],[32,1,33,1],[32,2,32,7],[33,2,33,6],[29,3,29,8],[29,1,29,2],[27,3,27,8],[19,1,19,8],[23,1,23,2],[24,1,24,2],[25,1,25,2],[26,1,26,2],[23,3,23,8],[27,1,27,2],[26,3,26,8],[15,3,15,8],[9,3,9,8],[13,3,13,8],[14,3,14,8],[6,3,6,8],[8,3,8,8],[7,3,7,8]]}
[]
[]
[null,"Once completed save a copy of the Affordability calculator in the following folder Hotel/UserData/Mortgage Affordability Calculators with the name being the application number followed by the 1st applicants surname and the second applicants surname e.g. 1234 Surname1Surname 2  - save down 1 version in excel along with the output in PDF"]
[]
[null,"Type of mortgage required",null,"Select the repayment type (initial Assessment for Standard mortgages should be on Captial & Interest irrespective of repayment type) Where this fails I/O can be used where requested as a repayment type. Note Capital & interest max LTV 95%, Interest Only 60%",null,{"$f":"IF(AND(D5=\"Interest only\",#REF!>60%),\"WARNING LOAN EXCEEDS 60% LTV\",\"\")","v":{"$error":"#REF!"}}]
[null,"Gross Basic Income",null,"For each applicant:\nEmployed / Retired - Input the annual Gross basic  income/  prior to any deductions e.g. Tax, NI, Loans, Pension contributions. \nSelf Employed (ST/ P'Ship)-  lower of:\n• Most recent years share of net profit;\n• Average share of net profit of the last 2 years.\nSelf Employed (Ltd. Co.) - the lower of:\n• Most recent years director’s remuneration plus gross dividends;\n• Average of the last 2 years director’s remuneration plus gross dividends.\nNote – Self Employed Income will not be deemed usable whereby the latest year has seen a drop of more than 25% net profit."]
[null,"Gross Additional Income",null,"Input the total annual Amount of additional income such as regular bonus, overtime, allowances etc. prior to any deductions . Where using the average of the last 3 months pay slips note this must be in line with YTD / P60. (The calculator will default to include 50%)."]
[null,"Gross Other Income",null,"Input the annual Amount of other income on top of earned / pension income such as allowable benefits/ savings / investment /unencumbered property rental income. (The calculator will default to include 50%)."]
[null,"Net monthly income (monthly take home pay/pension):",null,"Employed - Retired - Insert the Net monthly income, where additional income fluctuates insert the average monthly net income.\nSelf Employed - The net income consistent with the tax returns should be used subject to Accounts confirming that drawings are < profit. Underwriter discretion may be applied where profits are not drawn in full this can be estimated by using the evidenced profit in the following calculator                                             www.employedandselfemployed.co.uk/setaxcalculator Refer cases to Underwriter."]
[null,"Other income (e.g. Savings / Investments income)",null,"Any other form of secondary income - Include any allowable benefits in here."]
[null,"Override",null,"Reg O/T Bous / Other Income - Should you agree to use a higher than the standard % of Additional income then the £value of the amount agreed to be used is inserted in the override - Must be agreed with U/W prior to use "]
[null,"Monthly committed expenditure:"]
[null,"HP / Loan repayments",null,"Input the total amount of loan repayments that a borrower has, note where the borrower is due to repay the loan within 3 months from completion this does not need to be included here but must be referenced in the notes and where this relates to a car for instance details of any final payments and or the borrower intensions re renewing ,must be captured in the notes also. Note - the exclusion of these payments from the calculation will be subject to underwriter assessment"]
[null,"Credit card Balances (total of all held)",null,"Input the total balances of credit cards held - including the average balance of a card where borrower pays in full."]
[null,"Credit card repayments (total)",null,"Input the amounts of the repayments borrower makes but exclude the full balance payment from this amount, although reference must be made in the notes including  the average balance that the borrower repays."]
[null,"Family maintenance",null,"Input any maintenance payments commitments - where this is due to finish in the next 3 months this can be excluded from the figures but must be referenced in the notes ."]
[null,"Other  unsecured commitments ",null,"Input the monthly cost of any other lending not captured above e.g. regular Overdraft charges / fees, Pay Day loans. Basic Pension contributions may be included here where not paid through a salary\nNote - Where the borrower has an Interest Only facility which is being assessed on Interest only rather than repayment repayment vehicle costs must be included here."]
[null," *Other non self financing mortgages/rent",null,"Mortgage Payments - I.e. Mortgage on second property or holiday home, where joint applicants but sole owner and the joint borrower is party to another mortgage (i.e. their own property) this must be included in here etc. note if the borrower holds a BTL held pays for itself (i.e. rent covers mortgage commitment) then this does not need to be included in the calculations - Proof of this not required for levels 1 -3.\nThis repayment amount must be stressed at the same rate as the prescribed Stress rate- refer to Input Calculation assist tab for the calculation of this.\nRent - Where the borrower pays rent for a property as well as also (for example in Self build cases whilst the build is being completed) this must be included here."]
[null,"Essential expenditure & basic standard of living costs :"]
[null,"Note - When assessing a case where there is a joint borrower added on where they will not reside in the property then Applicant1 should be the main person who will reside in the property to be mortgaged, it is important to include full income / expenditure details, inclusing household expenditure for the joint borrower who will not reside in the property- including stressed mortgage payment where they have one. Refer cases of this nature to Underwriter for guidance.\nUtilise the notes field to explain the borrower circumstances and discussions that you have had with regards to Expenditure. If affordability is tight but a borrower has given an explanation of how they intend to adjust their expenditure and what they can reduce further then capture this in the notes field in order to provide the underwriter with a full picture of the borrower expectations."]
[null,"Council tax","n/a","If the figure seems to be within expected ranges (and affordability and LTV <90%) no need to challenge - can be validated using online facility to check property using postcode, once confirmed the annual council tax can be divided by the number of months over which the tax is to be paid. Note -  Some areas charge council tax over a 10 month rather than 12 month period - apply the calculation that is applicable to the borrower - where this is unknown then a proxy can be calculated by dividing 12."]
[null,"Ground rent / service charge",4,"ONS data not used for this category as it does not apply to all cases. for leasehold properties there is an expectation that this will apply - If the property is an apartment /  flat then the expectation is that there will be a ground rent / service charge, for houses where this applies there is a tendency for this to be lower and service charges may not apply. "]
[null,"* Home Fuel & Utility Bills",4,"This is to include, Gas, electricity, Water, any other Fuel Bills that the borrower pays -e.g. Oil, Wood, Coal"]
[null,"*Food, groceries, toiletries and cleaning products","1, 5 and 12","borrower to calculate their average monthly spend - this is then assessed against ONS and the higher of the borrower stated/ ONS value is used (ONS uses 100% of category 1 - Food, 15% of category 5 - Cleaning Products and 31% of the 40% in category 12 which is for toiletries)"]
[null,"*Essential Travel Costs",7,"This is to include any Essential transport - i.e. Commute costs incl season tickets and dependants school college commute costs, car running and maintenance costs  to include petrol, servicing, MOT, Tax etc. but excludes Vehicle insurance (this is to be included in the insurance section)"]
[null,"*Essential Insurances ",12,"As a minimum this must include Buildings and contents - plus any other insurances that a borrower would consider to be essential - i.e. vehicle insurance where borrower owns a vehicle. ONS includes vehicle insurance!!! Other insurances such as life insurance /  pet insurance would only be included if a borrower deems these to be essential."]
[null,"*Telephones / Internet / TV and Satellite costs","8 & 9","To include landlines, mobiles, internet packages along with TV / Satellite packages - this figure has been combined as these are often combined packages that are not easy to separate out\n(To calculate from ONS this uses 95% of category 8 plus 10% of category 9)"]
[null,"Childcare (include School Fees if applicable)",null,"As these are unique to individual circumstances - Insert comment/ rationale if borrower has primary school age children, or younger and no childcare costs in here"]
[null,"*Clothing and Footwear",3,"Self Explanatory"]
[null,"Minimum surplus income required (5%)",null,"This does not require any inputs and cannot be overridden it covers the basic recreational costs, plus costs that don’t fit into other categories such as health, education, house hold goods, plus a small % of Alcohol/ narcotics, its simply to ensure that everything is considered - even the costs that you don't immediately think about."]
[null,"Overrides",null,"Refer the use of any override to an Underwriter - Overrides can be entered on permitted categories subject to core criteria being met and proofs obtained where applicable"]
[]
[null,"Level","Income evidence requirements",null,null,null,null,null,"Additional evidence requirements"]
[null,null,"Employed",null,null,null,null,"Self-employed"]
[null,"Level 1","1 month* \n(or 1 months worth where pay frequency is less than monthly) \nIf payslip is less than period 4 or bonus/overtime is being used then please provide latest P60",null,null,null,null,"Latest 2 years Tax calculation summaries supported by the \nLatest 2 years HMRC Tax year overviews\nLatest years accounts","None"]
[null,"Level 2","2 months* \n(or 2months worth where pay frequency is less than monthly) \nIf payslip is less than period 4 or bonus/overtime is being used then please provide latest P60",null,null,null,null,"Latest 2 years Tax calculation summaries supported by the \nLatest 2 years HMRC Tax year overviews\nLatest years accounts","None"]
[null,"Level 3","3 months* \n(or 3 months worth where pay frequency is less than monthly) \nIf payslip is less than period 4 or bonus/overtime is being used then please provide latest P60",null,null,null,null,"Latest 2 years Tax calculation summaries supported by the \nLatest 2 years HMRC Tax year overviews\nLatest years accounts","1 months personal main bank statements for all applicants including joint accounts"]
[null,"Level 4","4 months* \n(or 3  months worth where pay frequency is less than monthly) \nIf payslip is less than period 4 or bonus/overtime is being used then please provide latest P60",null,null,null,null,"Latest 2 years Tax calculation summaries\nHMRC Tax year overviews and \nLatest years accounts\n3 months business bank statements","3 months personal main bank statements for all applicants including joint accounts"]
[null,"*Note - Where Basic Salary fluctuates each month or additional income (e.g. Bonuses / Overtime/ Allowances) is used additional evidence may be requested e.g. P60."]

{"sheet":"ONS Update","index":11,"n_rows":74,"n_cols":18,"rows_kept":74,"cut":false,"hidden":true,"merged":[[26,10,26,15],[27,10,27,11],[2,11,19,14]]}
[null,null,"Single:",null,null,null,"Joint:"]
[null,"Dependants",0,1,2,3,0,1,2,3]
[null,"Monthly",{"$f":"ROUND(+C49,0)","v":1171},{"$f":"ROUND(+E49,0)","v":1166},{"$f":"ROUND(+F49,0)","v":1290},{"$f":"(J3/I3)*E3","v":1381.4009661835751},{"$f":"ROUND(+D49,0)","v":1609},{"$f":"ROUND(+G49,0)","v":1645},{"$f":"ROUND(+H49,0)","v":1863},{"$f":"ROUND(+I49,0)","v":1995},null,"Instructions for updating ONS - Note the fields requiring update on this tab are in yellow\n1 - Create new tab for A23 data table (label this Extract-ONS A23 xxxxye) and copy over latest data from website www.ons.gov.uk\n2 - Copy the monthly totals in line 46 down into line 66 as these are about to become the previous totals ( and the differenceds between the 2 are calculated once populated with the latest figures which allow you to sense check the data)\n3 - Copy and paste the data from A23 table into the yellow table (A23-I46) taking care to ensure that the data is always in thesame fields - note it may be easier to remove the values from A29-I46 of the table and copy a blank table over to the newly created Extract tab to fill it in before copying back over to this tab.\n4 - Check the movements / differences - you would expect these to be reasonably minimal - double check any large differences. \n5 - The assumptions made in the table below should be checked against the latest version of the A1 breakdown "]
[]
[null,"Code for Lookup where adult =1 and child =10",1,11,21,31,2,12,22,32]
[1,"Food & non-alcoholic drinks",{"$f":"+C53*(VLOOKUP($A6,$K$29:$M$41,3,FALSE))","v":152.96666666666667},{"$f":"+E53*(VLOOKUP($A6,$K$29:$M$41,3,FALSE))","v":205.70550000000003},{"$f":"+F53*(VLOOKUP($A6,$K$29:$M$41,3,FALSE))","v":235.73333333333332},{"$f":"+G53*(VLOOKUP($A6,$K$29:$M$41,3,FALSE))","v":333.66666666666669},{"$f":"+D53*(VLOOKUP($A6,$K$29:$M$41,3,FALSE))","v":279.06666666666666},{"$f":"+G53*(VLOOKUP($A6,$K$29:$M$41,3,FALSE))","v":333.66666666666669},{"$f":"+H53*(VLOOKUP($A6,$K$29:$M$41,3,FALSE))","v":402.13333333333327},{"$f":"+I53*(VLOOKUP($A6,$K$29:$M$41,3,FALSE))","v":427.26666666666665}]
[2,"Alcoholic drinks, tobacco & narcotics",{"$f":"+C54*(VLOOKUP($A7,$K$29:$M$41,3,FALSE))","v":14.386666666666668},{"$f":"+E54*(VLOOKUP($A7,$K$29:$M$41,3,FALSE))","v":9.0133333333333336},5.8933333333333335,{"$f":"(J7/I7)*E7","v":3.5464306784660766},{"$f":"+D54*(VLOOKUP($A7,$K$29:$M$41,3,FALSE))","v":25.133333333333336},{"$f":"+G54*(VLOOKUP($A7,$K$29:$M$41,3,FALSE))","v":14.040000000000001},19.58666666666667,11.786666666666667]
[3,"Clothing & footwear",18.416666666666668,39.43333333333333,38.133333333333333,40.281690140845065,39.866666666666667,48.099999999999994,61.533333333333331,65]
[4,"Housing(net)2, fuel & power",308.09999999999997,368.22499999999997,462.47500000000002,523.62871900826451,415.34999999999997,367.25,393.25,445.25]
[5,"Household goods & services",51.48,44.07,47.58,41.285784753363224,78,82.875,86.970000000000013,75.465000000000003]
[6,"Health",0,0,0,0,0,0,0,0,null,null,null,null,null,null,"Council tax"]
[7,"Transport",125.90500000000002,138.86166666666668,117.17333333333335,127.70024069409462,278.28666666666663,287.8633333333334,335.46500000000003,365.60333333333335,null,null,null,null,null,null,"Ground rent / service charge"]
[8,"Communication",62.573333333333323,75.334999999999994,72.041666666666657,78.618084370677735,89.743333333333339,93.86,99.211666666666659,108.26833333333335,null,null,null,null,null,null,"* Home Fuel & Utility Bills"]
[9,"Recreation & culture",56.116666666666667,66.040975000000017,52.62833333333333,37.627030417058641,113.14333333333332,112.53666666666666,161.22166666666664,115.26666666666665,null,null,null,null,null,null,"*Food, groceries, toiletries and cleaning products"]
[10,"Education",0,0,0,null,0,0,0,0,null,null,null,null,null,null,"*Travel Costs"]
[11,"Restaurants & hotels",22.1,19.846666666666668,16.986666666666668,15.626524317912219,49.74666666666667,37.006666666666668,48.706666666666671,44.806666666666672,null,null,null,null,null,null,"*Essential Insurances "]
[12,"Miscellaneous goods & services",102.69999999999999,128.69999999999999,102.69999999999999,115.39325842696628,196.29999999999998,224.03333333333333,231.39999999999998,260,null,null,null,null,null,null,"*Telephones / Internet / TV and Satellite costs"]
[null,null,null,null,null,null,null,null,null,null,null,null,null,null,null,null,"Childcare (should we include School Fees in here also)"]
[null,null,{"$f":"SUM(C6:C18)","v":914.74499999999989},{"$f":"SUM(D6:D18)","v":1095.231475},1151.345,1317.3744294743151,1564.6366666666668,1601.2316666666666,1839.478333333333,1918.7133333333331,null,null,null,null,null,null,"*Clothing and Footwear"]
[null,null,"Updates from A23 table input into yellow cells",null,null,null,null,null,null,null,null,null,null,null,null,null,"Other"]
[]
[null,null,null,null,null,null,null,null,null,null,null,"ONS DATA",null,null,null,null,"Total expenditure"]
[null,null,"One","Two","One adult",null,"Two adults",null,null,null,null,"https://www.ons.gov.uk/peoplepopulationandcommunity/personalandhouseholdfinances/expenditure/datasets/familyspendingworkbook2expenditurebyincome"]
[null,null,"person","adults","with","with","with","with","with",null,null,null,null,null,null,null,"Net income"]
[null,null," ",null,"one","two","one","two","three",null,null,"Table A23"]
[null,null,null,null,"child","or more","child","children","or more",null,null,null,null,null,null,null,"Minimum surplus income required (5%)"]
[null,null,null,null,null,"children",null,null,"children",null,"This table is populated from the assumptions made on the ONS expenditure breakdown tab"]
[null,null,null,null,null,null,null,null,null,null,"ONS Category",null,"Proposed % to use as minimum","Essential, Basic Standard of Living or  Excluded","Examples of whats included in the % being used","Examples of whats excluded","Associated Category on the Affordability calculator ","notes"]
[1,"Food & non-alcoholic drinks",35.299999999999997,64.400000000000006,47.470500000000008,54.4,77,92.8,98.6,null,1,"Food and non-alcoholic drinks",1,{"$f":"VLOOKUP($K29,'ONS expenditure breakdown A1'!$K$17:$Q$757,7,FALSE)","v":"Essential"},"Full amount for Food & non-alcoholic drinks included","n/a","Home Fuel & Utility Bills"]
[2,"Alcoholic drinks, tobacco & narcotics",8.3000000000000007,14.5,5.2,3.4,8.1,11.3,6.8,null,2,"Alcoholic drink, tobacco and narcotics",0.4,{"$f":"VLOOKUP($K30,'ONS expenditure breakdown A1'!$K$17:$Q$757,7,FALSE)","v":"Basic "},"Alcoholic drinks, tobacco & narcotics","60% proportion - in case of financial hardship expectation to reduce spend. Aprox 40% of this cost is cigarettes/tobacco which for smokers could potentially be more difficult to reduce  ","Food, groceries, toiletries and cleaning products"]
[3,"Clothing & footwear",8.5,18.399999999999999,18.2,17.600000000000001,22.2,28.4,30,null,3,"Clothing and footwear",{"$f":"VLOOKUP($K31,'ONS expenditure breakdown A1'!$K$17:$P$757,6,FALSE)","v":0.5},{"$f":"VLOOKUP($K31,'ONS expenditure breakdown A1'!$K$17:$Q$757,7,FALSE)","v":"Basic "},"Clothing & footwear","50% in case of financial hardship expectation to reduce spend","Clothing and Footwear"]
[4,"Housing(net)2, fuel & power",94.8,127.8,113.3,142.30000000000001,113,121,137,null,4,"Housing(net), fuel and power",0.75,{"$f":"VLOOKUP($K32,'ONS expenditure breakdown A1'!$K$17:$Q$757,7,FALSE)","v":"Essential"},"Fuel / Power and utilities","rent payment - if purchasing property unlikely to be paying rent also some non essential maintenance and alternative fuels which are considered to be an alternative to gas and electricity not in addition to","Home Fuel & Utility Bills"]
[5,"Household goods & services",26.4,40,22.6,24.4,42.5,44.6,38.700000000000003,null,5,"Household goods and services ",0.45,{"$f":"VLOOKUP($K33,'ONS expenditure breakdown A1'!$K$17:$Q$757,7,FALSE)","v":"Basic "},"Cleaning materials / Detergents etc. plus Household appliances/Furniture ","Electrical/ Garden tools, Tablewear, Utensils, 50% of furniture costs, decorative goods, Floor Coverings, Textiles","35% for cleaning / detergents included in Food, groceries, toiletries and cleaning products, remaining 65% in minimum surplus income required"]
[6,"Health",0,0,0,0,0,0,0,null,6,"Health",0.75,{"$f":"VLOOKUP($K34,'ONS expenditure breakdown A1'!$K$17:$Q$757,7,FALSE)","v":"Essential"},"Medicines, prescriptions, opticians etc","Private Dental / Medical costs","Minimum surplus income required "]
[7,"Transport",44.7,98.8,49.3,41.6,102.2,119.1,129.80000000000001,null,7,"Transport",0.65,{"$f":"VLOOKUP($K35,'ONS expenditure breakdown A1'!$K$17:$Q$757,7,FALSE)","v":"Essential & Basic "},"Vehicle running costs  & other travel costs (incl. season tickets etc)","35% for non essential travel and some duplication ie car running costs plus public transport costs and both may not apply.","Travel Costs","could potentially reduce further if not car owner to 365% dependant upon distance of commute etc"]
[8,"Communication",15.2,21.8,18.3,17.5,22.8,24.1,26.3,null,8,"Communication",0.95,{"$f":"VLOOKUP($K36,'ONS expenditure breakdown A1'!$K$17:$Q$757,7,FALSE)","v":"Essential"},"landlines, mobiles and internet","Purchasing of New Phones / Mobiles / Faxes","Telephones / Internet / TV and Satellite costs"]
[9,"Recreation & culture",37,74.599999999999994,43.543500000000009,34.700000000000003,74.2,106.3,76,null,9,"Recreation and culture",0.35,{"$f":"VLOOKUP($K37,'ONS expenditure breakdown A1'!$K$17:$Q$757,7,FALSE)","v":"Basic "},"TV, Satelite","65% of the costs in this category is excluded - in cases of Financial Hardship it would be expected that recreational experiances could be reduced considerably eg Holidays abroad","Telephones / Internet / TV and Satellite costs"]
[10,"Education",null,null,null,null,null,null,null,null,10,"Education",0,{"$f":"VLOOKUP($K38,'ONS expenditure breakdown A1'!$K$17:$Q$757,7,FALSE)","v":"Basic "},"school costs, trips etc","Private school fees, nursery etc picked up by Underwriters. School trips classed as discretionary spending. ","Minimum surplus income required "]
[11,"Restaurants & hotels",25.5,57.4,22.9,19.600000000000001,42.7,56.2,51.7,null,11,"Restaurants and hotels",0.2,{"$f":"VLOOKUP($K39,'ONS expenditure breakdown A1'!$K$17:$Q$757,7,FALSE)","v":"Basic "},"Snacks and confectionery, school meals or meals bought and eaten at the office and  50% of takeaway spend ","Holidays, Restaurant / Café meals and 50% of takeaway spend ","Minimum surplus income required "]
[12,"Miscellaneous goods & services",23.7,45.3,29.7,23.7,51.7,53.4,60,null,12,"Miscellaneous goods and services",1,{"$f":"VLOOKUP($K40,'ONS expenditure breakdown A1'!$K$17:$Q$757,7,FALSE)","v":"Buildings Ins- Essential, Toilerires and Soap Essential, remainder - Basic "},"Insurances (B&C), (Vehicle),  Personal Care -Toiletries","Costs associated with moving house- furniture storage and removal as these would be one offs, bank charges and annual credit card fees , personal effects - watches/ Jewelry etc","70% for insurances (B&C)c25%, (Vehicle )c45% included in Essential Insurances and 30% for Personal Care -Toiletries included in Food, groceries, toiletries and cleaning products"]
[null,null,null,null,null,null,null,null,null,null,13,"Other expenditure items",{"$f":"VLOOKUP($K41,'ONS expenditure breakdown A1'!$K$17:$P$757,6,FALSE)","v":0},{"$f":"VLOOKUP($K41,'ONS expenditure breakdown A1'!$K$17:$Q$757,7,FALSE)","v":"Excluded"},"none - All considered non-essential","Mortgage payments as no need to include, fines, holiday spends, gifts and donations are considered to be non essential","n/a "]
["1-12","All expenditure groups",326.5,573.9,389.9,386.9,581.6,678.9,692.5,null,14,"Other items recorded","Excluded","Excluded","none ","Items of expenditure covered by using monthly income - i.e Tax, Ni and pension costs","n/a "]
[]
[13,"Other expenditure items",57.6,91.3,46.8,40.299999999999997,102.6,114.7,113.7]
[]
["Total expenditure",null,384.1,665.2,436.7,427.1,684.1,793.6,805.9]
[]
[null,"Essential expenditure used",{"$f":"SUM(C29:C37)-A1048559-A1048563","v":270.2},{"$f":"SUM(D29:D36)-D30-D34","v":371.20000000000005},269.1705,297.80000000000007,379.7,430.00000000000006,460.4]
[null,"Monthly",{"$f":"+C48*52/12","v":1170.8666666666666},1608.5333333333335,1166.4055000000001,1290.4666666666669,1645.3666666666666,1863.3333333333337,1995.0666666666666]
[]
[]
[null,"Monthly"]
[null,"Food & non-alcoholic drinks",{"$f":"+C29*52/12","v":152.96666666666667},{"$f":"+D29*52/12","v":279.06666666666666},205.70550000000003,235.73333333333332,333.66666666666669,402.13333333333327,427.26666666666665]
[null,"Alcoholic drinks, tobacco & narcotics",{"$f":"+C30*52/12","v":35.966666666666669},62.833333333333336,22.533333333333335,14.733333333333333,35.1,48.966666666666669,29.466666666666665]
[null,"Clothing & footwear",36.833333333333336,79.733333333333334,78.86666666666666,76.266666666666666,96.199999999999989,123.06666666666666,130]
[null,"Housing(net)2, fuel & power",410.79999999999995,553.79999999999995,490.96666666666664,616.63333333333333,489.66666666666669,524.33333333333337,593.66666666666663]
[null,"Household goods & services",114.39999999999999,173.33333333333334,97.933333333333337,105.73333333333333,184.16666666666666,193.26666666666668,167.70000000000002]
[null,"Health",0,0,0,0,0,0,0]
[null,"Transport",193.70000000000002,428.13333333333327,213.63333333333333,180.26666666666668,442.86666666666673,516.1,562.4666666666667]
[null,"Communication",65.86666666666666,94.466666666666683,79.3,75.833333333333329,98.800000000000011,104.43333333333334,113.96666666666668]
[null,"Recreation & culture",160.33333333333334,323.26666666666665,188.68850000000006,150.36666666666667,321.53333333333336,460.63333333333327,329.33333333333331]
[null,"Education",0,0,0,0,0,0,0]
[null,"Restaurants & hotels",110.5,248.73333333333332,99.233333333333334,84.933333333333337,185.03333333333333,243.53333333333333,224.03333333333333]
[null,"Miscellaneous goods & services",102.69999999999999,196.29999999999998,128.69999999999999,102.69999999999999,224.03333333333333,231.39999999999998,260]
[]
[null,"Previous ONS Monthly",835.0333333333333,1453.8333333333337,887.4666666666667,1060.8,1529.6666666666667,1627.6000000000001,1606.8000000000002]
[]
[null,"Increase / decrease",{"$f":"(C49-C66)/C66","v":0.40217955371043063},{"$f":"(D49-D66)/D66","v":0.10640834575260789},0.31430908203125002,0.21650326797385649,7.5637393767705258E-2,0.14483493077742293,0.24163969795037737]
[]
[]
[]
[null,null,433.68150000000003,793.45350000000008,461.20199999999994,496.2405,843.43350000000021,940.43250000000023,904.68000000000006]
[null,null,384.1,665.2,436.7,427.1,684.1,793.6,805.9]
[null,null,{"$f":"C73/C72","v":0.88567301118447528},{"$f":"D73/D72","v":0.83836040801382816},0.94687360419078848,0.86067138816763245,0.81108943384392473,0.84386705053260047,0.89081222089578627]

{"sheet":"ONS 2024","index":12,"n_rows":68,"n_cols":22,"rows_kept":68,"cut":false,"hidden":true,"merged":[[6,13,6,14],[21,5,21,20]]}
["Table A23",null,null,null,null,null,null,null,null,null,null,null,null,"Back to Contents"]
["High level expenditure by household composition"]
["UK, financial year ending 2023"]
[]
[]
[null,null,null,null,"Retired households",null,null,null,null,null,"Non-retired",null,null,"Retired and non-retired households"]
[null,null,null,null,"State pension1",null,null,"Other retired",null,null,"One","Two",null,"One adult",null,null,"Two adults",null,null,null,"Three or more adults"]
[null,null,null,null,"One","Two ",null,"One","Two",null,"person","adults",null,"with","with",null,"with","with","with",null,"without","with"]
[null,null,null,null,"person","adults",null,"person","adults",null," ",null,null,"one","two",null,"one","two","three",null,"children","children"]
[null,null,null,null,null,null,null,null,null,null,null,null,null,"child","or more",null,"child","children","or more"]
[null,null,null,null,null,null,null,null,null,null,null,null,null,null,"children",null,null,null,"children"]
[]
[]
["Weighted number of households (thousands)",null,null,null,860,420,null,2640,2940,null,5330,6940,null,800,710,null,2280,2540,860,null,1960,1010]
["Total number of households in sample",null,null,null,130,70,null,420,570,null,740,1070,null,110,100,null,330,370,140,null,290,140]
["Total number of persons in sample",null,null,null,130,150,null,420,1130,null,740,2130,null,220,330,null,980,1500,730,null,950,670]
["Total number of adults in sample",null,null,null,130,150,null,420,1130,null,740,2130,null,110,100,null,650,750,270,null,950,460]
[]
["Weighted average number of persons per household",null,null,null,1,2,null,1,2,null,1,2,null,2,3.3,null,3,4,5.4,null,3.4,5]
[]
[]
["Commodity or service",null,null,null,null,"Average weekly household expenditure (£)"]
[]
[]
[1,"Food & non-alcoholic drinks",null,null,36.700000000000003,61,null,38.9,69.3,null,35.299999999999997,64.400000000000006,null,47.5,54.4,null,77,92.8,98.6,null,94.1,102.3]
[]
[2,"Alcoholic drinks, tobacco & narcotics",null,null,5.5,10.5,null,6.1,15.6,null,8.3000000000000007,14.5,null,5.2,3.4,null,8.1,11.3,6.8,null,13.7,13]
[]
[3,"Clothing & footwear",null,null,3.6,10,null,7,13.1,null,8.5,18.399999999999999,null,18.2,17.600000000000001,null,22.2,28.4,30,null,24.2,30.6]
[]
[4,"Housing (net)², fuel & power",null,null,53.9,69.900000000000006,null,58.7,74.5,null,94.8,127.8,null,113.3,142.30000000000001,null,113,121,137,null,124.6,133.5]
[]
[5,"Household goods & services",null,null,20.2,14.9,null,28.3,43.3,null,26.4,40,null,22.6,24.4,null,42.5,44.6,38.700000000000003,null,41.6,34.5]
[]
[6,"Health",null,null,"..","..",null,"..","..",null,"..","..",null,"..","..",null,"..","..","..",null,"..",".."]
[]
[7,"Transport",null,null,13.5,34.6,null,32,75.900000000000006,null,44.7,98.8,null,49.3,41.6,null,102.2,119.1,129.80000000000001,null,122.5,105.8]
[]
[8,"Communication",null,null,10.3,16.399999999999999,null,13.6,19.899999999999999,null,15.2,21.8,null,18.3,17.5,null,22.8,24.1,26.3,null,30.4,30.7]
[]
[9,"Recreation & culture",null,null,22.1,41.9,null,47.2,76.400000000000006,null,37,74.599999999999994,null,43.5,34.700000000000003,null,74.2,106.3,76,null,90.1,71.900000000000006]
[]
[10,"Education",null,null,"..","..",null,"..","..",null,"..","..",null,"..","..",null,"..","..","..",null,"..",".."]
[]
[11,"Restaurants & hotels",null,null,7.9,18,null,16.100000000000001,42.5,null,25.5,57.3,null,22.9,19.600000000000001,null,42.7,56.2,51.7,null,53.6,48.3]
[]
[12,"Miscellaneous goods & services",null,null,17,25.2,null,27.7,42.9,null,23.7,45.3,null,29.7,23.7,null,51.7,53.4,60,null,54.3,62.6]
[]
[]
["1-12","All expenditure groups",null,null,194.1,313.89999999999998,null,282.39999999999998,492.7,null,326.5,573.9,null,389.9,386.9,null,581.6,678.9,692.5,null,663.2,655.7]
[]
[]
[13,"Other expenditure items",null,null,26.2,44.9,null,41.9,60.6,null,57.6,91.3,null,46.8,40.299999999999997,null,102.6,114.7,113.4,null,84.9,91.7]
[]
[]
["Total expenditure",null,null,null,220.3,358.8,null,324.2,553.29999999999995,null,384.1,665.2,null,436.7,427.1,null,684.1,793.6,805.9,null,748.1,747.4]
[]
[]
["Average weekly expenditure per person (£)"]
["Total expenditure",null,null,null,220.3,179.4,null,324.2,276.7,null,384.1,332.6,null,218.4,128.4,null,228,198.4,148.30000000000001,null,221.1,150.6]
[]
[]
["Note: The commodity and service categories are not comparable to those in publications before 2001-02."]
["Please see background notes for symbols and conventions used in this report."]
["1 Mainly dependent on state pensions and not economically active - see Methodology - Economically Inactive."]
["2 Excluding mortgage interest payments, council tax and Northern Ireland rates Mortgage interest payments can be found in category 13."]
[]
["Source: Office for National Statistics"]

{"sheet":"ONS 2022","index":13,"n_rows":69,"n_cols":62,"rows_kept":69,"cut":false,"hidden":true,"merged":[[21,5,21,20],[11,34,11,35],[6,57,6,58],[6,13,6,14],[6,28,6,29],[6,38,6,39],[6,49,6,50]]}
["Table A23",null,null,null,null,null,null,null,null,null,null,null,null,null,null,null,null,null,null,null,null,"Back to Contents"]
["Expenditure by household composition"]
["UK, financial year ending 2020"]
[]
[]
[null,null,null,null,"Retired households",null,null,null,null,null,"Non-retired",null,null,"Retired and non-retired households",null,null,null,null,null,null,null,null,null,null,null,null,"Non-retired",null,"Retired and non-retired households",null,null,null,null,null,null,2022,"Non-retired",null,"Retired and non-retired households",null,null,null,null,null,null,null,null,"Non-retired",null,"Retired and non-retired households",null,null,null,null,null,"Non-retired",null,"Retired and non-retired households"]
[null,null,null,null,"State pension1",null,null,"Other retired",null,null,"One","Two",null,"One adult",null,null,"Two adults",null,null,null,"Three or more adults",null,null,null,null,null,"One","Two","One adult",null,"Two adults",null,null,null,null,null,"One","Two","One adult",null,"Two adults",null,null,null,null,null,null,"One","Two","One adult",null,"Two adults",null,null,null,"One","Two","One adult",null,"Two adults"]
[null,null,null,null,"One","Two ",null,"One","Two",null,"person","adults",null,"with","with",null,"with","with","with",null,"without","with",null,null,null,null,"person","adults","with","with","with","with","with",null,null,null,"person","adults","with","with","with","with","with",null,null,null,null,"person","adults","with","with","with","with","with",null,"person","adults","with","with","with","with","with"]
[null,null,null,null,"person","adults",null,"person","adults",null," ",null,null,"one","two",null,"one","two","three",null,"children","children",null,null,null,null," ",null,"one","two","one","two","three",null,null,null," ",null,"one","two","one","two","three",null,null,null,null," ",null,"one","two","one","two","three",null," ",null,"one","two","one","two","three"]
[null,null,null,null,null,null,null,null,null,null,null,null,null,"child","or more",null,"child","children","or more",null,null,null,null,null,null,null,null,null,"child","or more","child","children","or more",null,null,null,null,null,"child","or more","child","children","or more",null,null,null,null,null,null,"child","or more","child","children","or more",null,null,null,"child","or more","child","children","or more"]
[null,null,null,null,null,null,null,null,null,null,null,null,null,null,"children",null,null,null,"children",null,null,null,null,null,null,null,null,null,null,"children",null,null,"children",null,null,null,null,null,null,"children",null,null,"children",null,null,null,null,null,null,null,"children",null,null,"children",null,null,null,null,"children",null,null,"children"]
[null,null,null,null,null,null,null,null,null,null,null,null,null,null,null,null,null,null,null,null,null,null,null,null,null,"2020 (A23 ONS Data)",null,null,null,null,null,null,null,null,"Derived Data"]
[]
["Weighted number of households (thousands)",null,null,null,770,470,null,2780,2770,null,4370,6220,null,620,540,null,2190,2540,960,null,2520,1080,null,null,1,"Food & non-alcoholic drinks",32.5,63.5,41.1,55,71.7,88.2,103.9,null,"1","Food and non-alcoholic drinks",37.537500000000001,73.342500000000001,47.470500000000008,63.525000000000006,82.813500000000019,101.87100000000002,120.00450000000002,null,null,"1","Food and non-alcoholic drinks",{"$f":"AK14-AA14","v":5.0375000000000014},{"$f":"AL14-AB14","v":9.8425000000000011},6.3705000000000069,8.5250000000000057,11.113500000000016,13.671000000000021,16.104500000000016,null,{"$f":"AV14/AA14","v":0.15500000000000005},{"$f":"AW14/AB14","v":0.15500000000000003},0.15500000000000017,0.15500000000000011,0.15500000000000022,0.15500000000000022,0.15500000000000014]
["Total number of households in sample",null,null,null,140,120,null,530,640,null,840,1190,null,140,130,null,420,510,190,null,410,170,null,null,2,"Alcoholic drinks, tobacco & narcotics",9.1999999999999993,15.9,7.5,6.6,12.4,11.6,10.7,null,"2","Alcoholic drinks, tobacco and narcotics",10.626000000000001,18.364500000000003,8.6625000000000014,7.6230000000000002,14.322000000000003,13.398000000000001,12.358500000000001,null,null,"2","Alcoholic drinks, tobacco and narcotics",{"$f":"AK15-AA15","v":1.4260000000000019},{"$f":"AL15-AB15","v":2.4645000000000028},{"$f":"AM15-AC15","v":1.1625000000000014},{"$f":"AN15-AD15","v":1.0230000000000006},{"$f":"AO15-AE15","v":1.9220000000000024},{"$f":"AP15-AF15","v":1.7980000000000018},{"$f":"AQ15-AG15","v":1.6585000000000019},null,{"$f":"AV15/AA15","v":0.15500000000000022},{"$f":"AW15/AB15","v":0.15500000000000017},{"$f":"AX15/AC15","v":0.15500000000000019},{"$f":"AY15/AD15","v":0.15500000000000008},{"$f":"AZ15/AE15","v":0.15500000000000019},{"$f":"BA15/AF15","v":0.15500000000000017},{"$f":"BB15/AG15","v":0.15500000000000019}]
["Total number of persons in sample",null,null,null,140,240,null,530,1290,null,840,2390,null,290,440,null,1270,2040,990,null,1370,850,null,null,3,"Clothing & footwear",11,24,16.899999999999999,23.8,31.4,33.5,31.1,null,"3","Clothing and footwear",12.705000000000002,27.720000000000006,19.519500000000004,27.489000000000004,36.267000000000003,38.69250000000001,35.920500000000004,null,null,"3","Clothing and footwear",1.7050000000000018,3.720000000000006,2.6195000000000057,3.6890000000000036,4.8670000000000044,5.1925000000000097,4.8205000000000027,null,0.15500000000000017,0.15500000000000025,0.15500000000000036,0.15500000000000014,0.15500000000000014,0.15500000000000028,0.15500000000000008]
["Total number of adults in sample",null,null,null,140,240,null,530,1290,null,840,2390,null,140,130,null,850,1020,370,null,1370,570,null,null,4,"Housing(net)2, fuel & power",74,92.3,99.4,94.4,99.9,98,102.2,null,"4","Housing(net)2, fuel and power",108.78,135.68100000000001,146.11799999999999,138.768,146.85300000000001,144.06,150.23399999999998,null,null,"4","Housing(net)2, fuel and power",34.78,43.381000000000014,46.717999999999989,44.367999999999995,46.953000000000003,46.06,48.033999999999978,null,0.47000000000000003,0.4700000000000002,0.46999999999999986,0.46999999999999992,0.47000000000000003,0.47000000000000003,0.46999999999999975]
[null,null,null,null,null,null,null,null,null,null,null,null,null,null,null,null,null,null,null,null,null,null,null,null,5,"Household goods & services",19.100000000000001,42.5,21.9,21.2,50.7,46.7,49.7,null,"5","Household goods and services",22.060500000000005,49.087500000000006,25.294500000000003,24.486000000000004,58.558500000000009,53.938500000000012,57.403500000000008,null,null,"5","Household goods and services",2.9605000000000032,6.5875000000000057,3.3945000000000043,3.2860000000000049,7.8585000000000065,7.238500000000009,7.7035000000000053,null,0.15500000000000017,0.15500000000000014,0.15500000000000019,0.15500000000000025,0.15500000000000011,0.15500000000000019,0.15500000000000011]
["Weighted average number of persons per household",null,null,null,1,2,null,1,2,null,1,2,null,2,3.4,null,3,4,5.2,null,3.4,5,null,null,6,"Health",5.3,10.5,2.5,3.1,5.3,7.1,7.2,null,"6","Health",6.1215000000000011,12.127500000000001,2.8875000000000002,3.5805000000000007,6.1215000000000011,8.2004999999999999,8.3160000000000007,null,null,"6","Health",0.82150000000000123,1.6275000000000013,0.38750000000000018,0.48050000000000059,0.82150000000000123,1.1005000000000003,1.1160000000000005,null,0.15500000000000025,0.15500000000000011,0.15500000000000008,0.15500000000000019,0.15500000000000025,0.15500000000000005,0.15500000000000008]
[null,null,null,null,null,null,null,null,null,null,null,null,null,null,null,null,null,null,null,null,null,null,null,null,7,"Transport",45.2,101,38.6,43.1,100.6,115.8,106.6,null,"7","Transport",52.20600000000001,116.65500000000002,44.583000000000006,49.780500000000004,116.193,133.74900000000002,123.123,null,null,"7","Transport",7.0060000000000073,15.655000000000015,5.9830000000000041,6.6805000000000021,15.593000000000004,17.949000000000026,16.52300000000001,null,0.15500000000000017,0.15500000000000017,0.15500000000000011,0.15500000000000005,0.15500000000000005,0.15500000000000022,0.15500000000000011]
[null,null,null,null,null,null,null,null,null,null,null,null,null,null,null,null,null,null,null,null,null,null,null,null,8,"Communication",13.6,23.8,15.5,17.8,25.6,25.7,27,null,"8","Communication",15.708,27.489000000000004,17.902500000000003,20.559000000000005,29.568000000000005,29.683500000000002,31.185000000000006,null,null,"8","Communication",2.1080000000000005,3.6890000000000036,2.4025000000000034,2.7590000000000039,3.9680000000000035,3.9835000000000029,4.1850000000000058,null,0.15500000000000005,0.15500000000000014,0.15500000000000022,0.15500000000000022,0.15500000000000014,0.15500000000000011,0.15500000000000022]
["Commodity or service",null,null,null,null,"Average weekly household expenditure (£)",null,null,null,null,null,null,null,null,null,null,null,null,null,null,null,null,null,null,9,"Recreation & culture",33.700000000000003,87.4,37.700000000000003,42.1,80.400000000000006,103.2,83.2,null,"9","Recreation and culture",38.923500000000011,100.94700000000002,43.543500000000009,48.625500000000009,92.862000000000023,119.19600000000003,96.096000000000018,null,null,"9","Recreation and culture",5.2235000000000085,13.547000000000011,5.8435000000000059,6.5255000000000081,12.462000000000018,15.996000000000024,12.896000000000015,null,0.15500000000000025,0.15500000000000011,0.15500000000000014,0.15500000000000019,0.15500000000000019,0.15500000000000022,0.15500000000000017]
[null,null,null,null,null,null,null,null,null,null,null,null,null,null,null,null,null,null,null,null,null,null,null,null,10,"Education",null,null,null,null,null,null,null,null,"10","Education",null,null,null,null,null,null,null,null,null,"10","Education"]
[null,null,null,null,null,null,null,null,null,null,null,null,null,null,null,null,null,null,null,null,null,null,null,null,11,"Restaurants & hotels",27.1,63.3,21.7,31.7,61.6,74.3,61,null,"11","Restaurants and hotels",31.300500000000003,73.111500000000007,25.063500000000001,36.613500000000009,71.14800000000001,85.816500000000005,70.454999999999998,null,null,"11","Restaurants and hotels",{"$f":"AK24-AA24","v":4.2005000000000017},{"$f":"AL24-AB24","v":9.8115000000000094},{"$f":"AM24-AC24","v":3.3635000000000019},{"$f":"AN24-AD24","v":4.9135000000000097},{"$f":"AO24-AE24","v":9.5480000000000089},{"$f":"AP24-AF24","v":11.516500000000008},{"$f":"AQ24-AG24","v":9.4549999999999983},null,0.15500000000000005,0.15500000000000017,0.15500000000000008,0.1550000000000003,0.15500000000000014,0.15500000000000011,0.15499999999999997]
[1,"Food & non-alcoholic drinks",null,null,34,64.400000000000006,null,34.4,67.5,null,32.5,63.5,null,41.1,55,null,71.7,88.2,103.9,null,97.9,105.4,null,null,12,"Miscellaneous goods & services",27.4,47.5,29.6,28,60.8,64.900000000000006,58.9,null,"12","Miscellaneous goods and services",31.647000000000002,54.862500000000004,34.188000000000002,32.340000000000003,70.224000000000004,74.95950000000002,68.029499999999999,null,null,"12","Miscellaneous goods and services",4.2470000000000034,7.3625000000000043,4.588000000000001,4.3400000000000034,9.4240000000000066,10.059500000000014,9.1295000000000002,null,0.15500000000000014,0.15500000000000008,0.15500000000000003,0.15500000000000011,0.15500000000000011,0.15500000000000019,0.155]
[]
[2,"Alcoholic drinks, tobacco & narcotics",null,null,6.3,11.8,null,6.3,13.4,null,9.1999999999999993,15.9,null,7.5,6.6,null,12.4,11.6,10.7,null,24.6,17.3,null,null,"1-12","All expenditure groups",299.39999999999998,574.4,342.9,371,605.70000000000005,682.7,658.8,null,"1-12","All expenditure groups",367.6155,689.38800000000003,415.23299999999995,453.39,724.93050000000017,803.56500000000017,773.1255000000001,null,null,"1-12","All expenditure groups",68.21550000000002,114.98800000000006,72.33299999999997,82.389999999999986,119.23050000000012,120.86500000000012,114.32550000000015,null,0.22784068136272553,0.20018802228412266,0.21094488188976371,0.22207547169811317,0.19684744923229339,0.17703969532737676,0.1735359744990895]
[]
[3,"Clothing & footwear",null,null,7.9,9.5,null,8,19.100000000000001,null,11,24,null,16.899999999999999,23.8,null,31.4,33.5,31.1,null,40.1,55.3,null,null,13,"Other expenditure items",57.2,90.1,39.799999999999997,37.1,102.6,118.5,113.9,null,"13","Other expenditure items",66.066000000000003,104.06550000000001,45.969000000000001,42.850500000000011,118.50300000000001,136.86750000000004,131.55450000000002,null,null,"13","Other expenditure items",8.8659999999999997,13.96550000000002,6.169000000000004,5.7505000000000095,15.90300000000002,18.367500000000035,17.654500000000013,null,0.155,0.15500000000000022,0.15500000000000011,0.15500000000000025,0.15500000000000019,0.1550000000000003,0.15500000000000011]
[]
[4,"Housing(net)2, fuel & power",null,null,46.3,46.9,null,46.4,53,null,74,92.3,null,99.4,94.4,null,99.9,98,102.2,null,119,92.3,null,null,"Total expenditure",null,356.6,664.5,382.8,408.1,708.3,801.2,772.7,null,"Total expenditure",null,433.68150000000003,793.45350000000008,461.20199999999994,496.2405,843.43350000000021,940.43250000000023,904.68000000000006,null,null,"Total expenditure",null,77.081500000000005,128.95350000000008,78.40199999999993,88.140499999999975,135.13350000000025,139.23250000000019,131.98000000000002,null,0.2161567582725743,0.19406094808126423,0.20481191222570513,0.21597770154373921,0.19078568403219012,0.17377995506739913,0.17080367542383851]
[]
[5,"Household goods & services",null,null,13.7,33.200000000000003,null,16.899999999999999,39.700000000000003,null,19.100000000000001,42.5,null,21.9,21.2,null,50.7,46.7,49.7,null,51.7,48.7]
[]
[6,"Health",null,null,3.1,7.5,null,9.3000000000000007,12.2,null,5.3,10.5,null,2.5,3.1,null,5.3,7.1,7.2,null,11,6.2]
[]
[7,"Transport",null,null,17.7,41.7,null,25,63.2,null,45.2,101,null,38.6,43.1,null,100.6,115.8,106.6,null,137.19999999999999,146.4]
[]
[8,"Communication",null,null,10.9,16.8,null,12.5,18.7,null,13.6,23.8,null,15.5,17.8,null,25.6,25.7,27,null,31.1,36.4]
[]
[9,"Recreation & culture",null,null,31.3,58.3,null,42.5,99.7,null,33.700000000000003,87.4,null,37.700000000000003,42.1,null,80.400000000000006,103.2,83.2,null,108.9,97.5]
[]
[10,"Education",null,null,"..",":",null,"..","..",null,"[1.40]",2.7,null,"[10.70]","[4.20]",null,5.3,13.6,17.3,null,6.7,11.1]
[]
[11,"Restaurants & hotels",null,null,11.7,29.1,null,18.100000000000001,50.4,null,27.1,63.3,null,21.7,31.7,null,61.6,74.3,61,null,93.9,90.2]
[]
[12,"Miscellaneous goods & services",null,null,42.8,25.9,null,22.3,45.5,null,27.4,47.5,null,29.6,28,null,60.8,64.900000000000006,58.9,null,62.4,71.2]
[]
[]
["1-12","All expenditure groups",null,null,225.7,345.1,null,241.7,483.4,null,299.39999999999998,574.4,null,342.9,371,null,605.70000000000005,682.7,658.8,null,784.4,778]
[]
[]
[13,"Other expenditure items",null,null,31.3,40.1,null,33,67.8,null,57.2,90.1,null,39.799999999999997,37.1,null,102.6,118.5,113.9,null,110.4,107.8]
[]
[]
["Total expenditure",null,null,null,257,385.2,null,274.7,551.1,null,356.6,664.5,null,382.8,408.1,null,708.3,801.2,772.7,null,894.8,885.8]
[]
[]
["Average weekly expenditure per person (£)"]
["Total expenditure",null,null,null,257,192.6,null,274.7,275.60000000000002,null,356.6,332.3,null,191.4,118.6,null,236.1,200.3,147.9,null,259.8,177.3]
[]
[]
["Note: The commodity and service categories are not comparable to those in publications before 2001-02."]
["Please see background notes for symbols and conventions used in this report."]
["1 Mainly dependent on state pensions and not economically active."]
["2 Excluding mortgage interest payments, council tax and Northern Ireland rates."]
[]
[]
["Source: Office for National Statistics"]

{"sheet":"ONS 2021","index":14,"n_rows":69,"n_cols":54,"rows_kept":69,"cut":false,"hidden":true,"merged":[[6,13,6,14],[21,5,21,20],[6,28,6,29],[6,38,6,39],[6,49,6,50]]}
["Table A23",null,null,null,null,null,null,null,null,null,null,null,null,null,null,null,null,null,null,null,null,"Back to Contents"]
["Expenditure by household composition"]
["UK, financial year ending 2020"]
[]
[]
[null,null,null,null,"Retired households",null,null,null,null,null,"Non-retired",null,null,"Retired and non-retired households",null,null,null,null,null,null,null,null,null,null,null,null,"Non-retired",null,"Retired and non-retired households",null,null,null,null,null,null,2018,"Non-retired",null,"Retired and non-retired households",null,null,null,null,null,null,null,null,"Non-retired",null,"Retired and non-retired households"]
[null,null,null,null,"State pension1",null,null,"Other retired",null,null,"One","Two",null,"One adult",null,null,"Two adults",null,null,null,"Three or more adults",null,null,null,null,null,"One","Two","One adult",null,"Two adults",null,null,null,null,null,"One","Two","One adult",null,"Two adults",null,null,null,null,null,null,"One","Two","One adult",null,"Two adults"]
[null,null,null,null,"One","Two ",null,"One","Two",null,"person","adults",null,"with","with",null,"with","with","with",null,"without","with",null,null,null,null,"person","adults","with","with","with","with","with",null,null,null,"person","adults","with","with","with","with","with",null,null,null,null,"person","adults","with","with","with","with","with"]
[null,null,null,null,"person","adults",null,"person","adults",null," ",null,null,"one","two",null,"one","two","three",null,"children","children",null,null,null,null," ",null,"one","two","one","two","three",null,null,null," ",null,"one","two","one","two","three",null,null,null,null," ",null,"one","two","one","two","three"]
[null,null,null,null,null,null,null,null,null,null,null,null,null,"child","or more",null,"child","children","or more",null,null,null,null,null,null,null,null,null,"child","or more","child","children","or more",null,null,null,null,null,"child","or more","child","children","or more",null,null,null,null,null,null,"child","or more","child","children","or more"]
[null,null,null,null,null,null,null,null,null,null,null,null,null,null,"children",null,null,null,"children",null,null,null,null,null,null,null,null,null,null,"children",null,null,"children",null,null,null,null,null,null,"children",null,null,"children",null,null,null,null,null,null,null,"children",null,null,"children"]
[]
[]
["Weighted number of households (thousands)",null,null,null,770,470,null,2780,2770,null,4370,6220,null,620,540,null,2190,2540,960,null,2520,1080,null,null,1,"Food & non-alcoholic drinks",32.5,63.5,41.1,55,71.7,88.2,103.9,null,"1","Food and non-alcoholic drinks",31.4,60.8,40.5,57.1,69.3,83.4,88.6,null,null,"1","Food and non-alcoholic drinks",{"$f":"AA14-AK14","v":1.1000000000000014},{"$f":"AB14-AL14","v":2.7000000000000028},{"$f":"AC14-AM14","v":0.60000000000000142},{"$f":"AD14-AN14","v":-2.1000000000000014},{"$f":"AE14-AO14","v":2.4000000000000057},{"$f":"AF14-AP14","v":4.7999999999999972},{"$f":"AG14-AQ14","v":15.300000000000011}]
["Total number of households in sample",null,null,null,140,120,null,530,640,null,840,1190,null,140,130,null,420,510,190,null,410,170,null,null,2,"Alcoholic drinks, tobacco & narcotics",9.1999999999999993,15.9,7.5,6.6,12.4,11.6,10.7,null,"2","Alcoholic drinks, tobacco and narcotics",9.3000000000000007,15.1,4.7,7.1,11.2,12.3,13.3,null,null,"2","Alcoholic drinks, tobacco and narcotics",-0.10000000000000142,0.80000000000000071,2.8,-0.5,1.2000000000000011,-0.70000000000000107,-2.6000000000000014]
["Total number of persons in sample",null,null,null,140,240,null,530,1290,null,840,2390,null,290,440,null,1270,2040,990,null,1370,850,null,null,3,"Clothing & footwear",11,24,16.899999999999999,23.8,31.4,33.5,31.1,null,"3","Clothing and footwear",9.8000000000000007,25.1,17.899999999999999,24.8,26.2,43.8,34.4,null,null,"3","Clothing and footwear",1.1999999999999993,-1.1000000000000014,-1,-1,5.1999999999999993,-10.299999999999997,-3.2999999999999972]
["Total number of adults in sample",null,null,null,140,240,null,530,1290,null,840,2390,null,140,130,null,850,1020,370,null,1370,570,null,null,4,"Housing(net)2, fuel & power",74,92.3,99.4,94.4,99.9,98,102.2,null,"4","Housing(net)2, fuel and power",70.3,84.1,85.2,63.3,86,89.1,100.6,null,null,"4","Housing(net)2, fuel and power",3.7000000000000028,8.2000000000000028,14.200000000000003,31.100000000000009,13.900000000000006,8.9000000000000057,1.6000000000000085]
[null,null,null,null,null,null,null,null,null,null,null,null,null,null,null,null,null,null,null,null,null,null,null,null,5,"Household goods & services",19.100000000000001,42.5,21.9,21.2,50.7,46.7,49.7,null,"5","Household goods and services",26.9,49.5,35.6,23.5,53.3,46.7,51.2,null,null,"5","Household goods and services",-7.7999999999999972,-7,-13.700000000000003,-2.3000000000000007,-2.5999999999999943,0,-1.5]
["Weighted average number of persons per household",null,null,null,1,2,null,1,2,null,1,2,null,2,3.4,null,3,4,5.2,null,3.4,5,null,null,6,"Health",5.3,10.5,2.5,3.1,5.3,7.1,7.2,null,"6","Health",5.5,7.1,1.3,4.2,5.4,5.9,6.6,null,null,"6","Health",-0.20000000000000018,3.4000000000000004,1.2,-1.1000000000000001,-0.10000000000000053,1.1999999999999993,0.60000000000000053]
[null,null,null,null,null,null,null,null,null,null,null,null,null,null,null,null,null,null,null,null,null,null,null,null,7,"Transport",45.2,101,38.6,43.1,100.6,115.8,106.6,null,"7","Transport",45.3,97.7,44.7,40.4,93.8,118.4,93.6,null,null,"7","Transport",-9.9999999999994316E-2,3.2999999999999972,-6.1000000000000014,2.7000000000000028,6.7999999999999972,-2.6000000000000085,13]
[null,null,null,null,null,null,null,null,null,null,null,null,null,null,null,null,null,null,null,null,null,null,null,null,8,"Communication",13.6,23.8,15.5,17.8,25.6,25.7,27,null,"8","Communication",11.6,19.600000000000001,14.8,15.5,21.3,22.6,23.8,null,null,"8","Communication",2,4.1999999999999993,0.69999999999999929,2.3000000000000007,4.3000000000000007,3.0999999999999979,3.1999999999999993]
["Commodity or service",null,null,null,null,"Average weekly household expenditure (£)",null,null,null,null,null,null,null,null,null,null,null,null,null,null,null,null,null,null,9,"Recreation & culture",33.700000000000003,87.4,37.700000000000003,42.1,80.400000000000006,103.2,83.2,null,"9","Recreation and culture",41.5,86.8,38.4,48.6,67.8,104.7,91.6,null,null,"9","Recreation and culture",-7.7999999999999972,0.60000000000000853,-0.69999999999999574,-6.5,12.600000000000009,-1.5,-8.3999999999999915]
[null,null,null,null,null,null,null,null,null,null,null,null,null,null,null,null,null,null,null,null,null,null,null,null,10,"Education","[1.40]",2.7,"[10.70]","[4.20]",5.3,13.6,17.3,null,"10","Education",6.1,5.5,8.8000000000000007,8.1999999999999993,14.2,15.9,23.6,null,null,"10","Education",null,{"$f":"AB23-AL23","v":-2.8},null,null,{"$f":"AE23-AO23","v":-8.8999999999999986},-2.3000000000000007,-6.3000000000000007]
[null,null,null,null,null,null,null,null,null,null,null,null,null,null,null,null,null,null,null,null,null,null,null,null,11,"Restaurants & hotels",27.1,63.3,21.7,31.7,61.6,74.3,61,null,"11","Restaurants and hotels",27.7,63.6,25.6,27.7,52.4,65.7,62.7,null,null,"11","Restaurants and hotels",{"$f":"AA24-AK24","v":-0.59999999999999787},{"$f":"AB24-AL24","v":-0.30000000000000426},{"$f":"AC24-AM24","v":-3.9000000000000021},{"$f":"AD24-AN24","v":4},9.2000000000000028,8.5999999999999943,-1.7000000000000028]
[1,"Food & non-alcoholic drinks",null,null,34,64.400000000000006,null,34.4,67.5,null,32.5,63.5,null,41.1,55,null,71.7,88.2,103.9,null,97.9,105.4,null,null,12,"Miscellaneous goods & services",27.4,47.5,29.6,28,60.8,64.900000000000006,58.9,null,"12","Miscellaneous goods and services",21.1,46.5,29.6,26,55.6,63.9,48.5,null,null,"12","Miscellaneous goods and services",{"$f":"AA25-AK25","v":6.2999999999999972},{"$f":"AB25-AL25","v":1},{"$f":"AC25-AM25","v":0},{"$f":"AD25-AN25","v":2},5.1999999999999957,1.0000000000000071,10.399999999999999]
[]
[2,"Alcoholic drinks, tobacco & narcotics",null,null,6.3,11.8,null,6.3,13.4,null,9.1999999999999993,15.9,null,7.5,6.6,null,12.4,11.6,10.7,null,24.6,17.3,null,null,"1-12","All expenditure groups",299.39999999999998,574.4,342.9,371,605.70000000000005,682.7,658.8,null,"1-12","All expenditure groups",306.39999999999998,561.29999999999995,347.1,346.5,556.4,672.5,638.6,null,null,"1-12","All expenditure groups",{"$f":"AA27-AK27","v":-7},13.100000000000023,-4.2000000000000455,24.5,49.300000000000068,10.200000000000045,20.199999999999932]
[]
[3,"Clothing & footwear",null,null,7.9,9.5,null,8,19.100000000000001,null,11,24,null,16.899999999999999,23.8,null,31.4,33.5,31.1,null,40.1,55.3,null,null,13,"Other expenditure items",57.2,90.1,39.799999999999997,37.1,102.6,118.5,113.9,null,"13","Other expenditure items",47.1,99.8,42.6,40.6,97.8,110.6,103.3,null,null,"13","Other expenditure items",{"$f":"AA29-AK29","v":10.100000000000001},-9.7000000000000028,-2.8000000000000043,-3.5,4.7999999999999972,7.9000000000000057,10.600000000000009]
[]
[4,"Housing(net)2, fuel & power",null,null,46.3,46.9,null,46.4,53,null,74,92.3,null,99.4,94.4,null,99.9,98,102.2,null,119,92.3,null,null,"Total expenditure",null,356.6,664.5,382.8,408.1,708.3,801.2,772.7,null,"Total expenditure",null,353.5,661.1,389.7,387,654.20000000000005,783.1,741.9,null,null,"Total expenditure",null,{"$f":"AA31-AK31","v":3.1000000000000227},3.3999999999999773,-6.8999999999999773,21.100000000000023,54.099999999999909,18.100000000000023,30.800000000000068]
[]
[5,"Household goods & services",null,null,13.7,33.200000000000003,null,16.899999999999999,39.700000000000003,null,19.100000000000001,42.5,null,21.9,21.2,null,50.7,46.7,49.7,null,51.7,48.7]
[]
[6,"Health",null,null,3.1,7.5,null,9.3000000000000007,12.2,null,5.3,10.5,null,2.5,3.1,null,5.3,7.1,7.2,null,11,6.2]
[]
[7,"Transport",null,null,17.7,41.7,null,25,63.2,null,45.2,101,null,38.6,43.1,null,100.6,115.8,106.6,null,137.19999999999999,146.4]
[]
[8,"Communication",null,null,10.9,16.8,null,12.5,18.7,null,13.6,23.8,null,15.5,17.8,null,25.6,25.7,27,null,31.1,36.4]
[]
[9,"Recreation & culture",null,null,31.3,58.3,null,42.5,99.7,null,33.700000000000003,87.4,null,37.700000000000003,42.1,null,80.400000000000006,103.2,83.2,null,108.9,97.5]
[]
[10,"Education",null,null,"..",":",null,"..","..",null,"[1.40]",2.7,null,"[10.70]","[4.20]",null,5.3,13.6,17.3,null,6.7,11.1]
[]
[11,"Restaurants & hotels",null,null,11.7,29.1,null,18.100000000000001,50.4,null,27.1,63.3,null,21.7,31.7,null,61.6,74.3,61,null,93.9,90.2]
[]
[12,"Miscellaneous goods & services",null,null,42.8,25.9,null,22.3,45.5,null,27.4,47.5,null,29.6,28,null,60.8,64.900000000000006,58.9,null,62.4,71.2]
[]
[]
["1-12","All expenditure groups",null,null,225.7,345.1,null,241.7,483.4,null,299.39999999999998,574.4,null,342.9,371,null,605.70000000000005,682.7,658.8,null,784.4,778]
[]
[]
[13,"Other expenditure items",null,null,31.3,40.1,null,33,67.8,null,57.2,90.1,null,39.799999999999997,37.1,null,102.6,118.5,113.9,null,110.4,107.8]
[]
[]
["Total expenditure",null,null,null,257,385.2,null,274.7,551.1,null,356.6,664.5,null,382.8,408.1,null,708.3,801.2,772.7,null,894.8,885.8]
[]
[]
["Average weekly expenditure per person (£)"]
["Total expenditure",null,null,null,257,192.6,null,274.7,275.60000000000002,null,356.6,332.3,null,191.4,118.6,null,236.1,200.3,147.9,null,259.8,177.3]
[]
[]
["Note: The commodity and service categories are not comparable to those in publications before 2001-02."]
["Please see background notes for symbols and conventions used in this report."]
["1 Mainly dependent on state pensions and not economically active."]
["2 Excluding mortgage interest payments, council tax and Northern Ireland rates."]
[]
[]
["Source: Office for National Statistics"]

{"sheet":"ONS 2016","index":15,"n_rows":69,"n_cols":18,"rows_kept":69,"cut":false,"hidden":true,"merged":[[21,6,21,16]]}
["Table A23"]
["Expenditure by household composition"]
["UK, financial year ending 2016"]
[]
[]
[null,null,null,null,null,"Retired households",null,null,null,"Non-retired",null,"Retired and non-retired households"]
[null,null,null,null,null,"State pension1",null,"Other retired",null,"One","Two","One adult",null,"Two adults",null,null,"Three or more adults"]
[null,null,null,null,null,"One","Two ","One","Two","person","adults","with","with","with","with","with","without","with"]
[null,null,null,null,null,"person","adults","person","adults"," ",null,"one","two","one","two","three","children","children"]
[null,null,null,null,null,null,null,null,null,null,null,"child","or more","child","children","or more"]
[null,null,null,null,null,null,null,null,null,null,null,null,"children",null,null,"children"]
[]
[]
["Weighted number of households (thousands)",null,null,null,null,740,450,2660,2830,4380,5860,670,580,2270,2340,960,2460,1040]
["Total number of households in sample",null,null,null,null,120,90,460,570,770,1060,130,130,400,460,200,370,160]
["Total number of persons in sample",null,null,null,null,120,190,460,1140,770,2130,270,440,1210,1820,1070,1240,770]
["Total number of adults in sample",null,null,null,null,120,190,460,1140,770,2130,130,130,810,910,400,1240,540]
[]
["Weighted average number of persons per household",null,null,null,null,1,2,1,2,1,2,2,3.4,3,4,5.3,3.4,4.9000000000000004]
[]
[]
["Commodity or service",null,null,null,null,null,"Average weekly household expenditure (£)"]
[]
[]
["1","Food and non-alcoholic drinks",null,null,null,25.4,51.4,32.700000000000003,63.2,29,56.8,42.5,55.4,65.3,81.400000000000006,86.1,82.2,93.1]
[]
["2","Alcoholic drinks, tobacco and narcotics",null,null,null,4.3,9.4,6.6,11.3,8.6999999999999993,13.8,6,7.5,10.9,12.5,11.3,17.7,16.5]
[]
["3","Clothing and footwear",null,null,null,4.5,12.4,7.8,18.2,8.5,25.8,21,22.9,29.6,32.799999999999997,39.299999999999997,44.9,48]
[]
["4","Housing(net)2, fuel and power",null,null,null,43.9,52.4,40.4,55.1,66.3,85.8,71.599999999999994,72.7,88.1,80.3,89.2,91.2,70.3]
[]
["5","Household goods and services",null,null,null,13.6,23.1,21.8,36.5,19.2,42.8,23.7,23.6,45.2,48.3,53.5,47.2,35.6]
[]
["6","Health",null,null,null,3.3,3.8,5.0999999999999996,13.8,3.4,9.1,1.1000000000000001,2.8,4.4000000000000004,10,4.0999999999999996,10.3,5.7]
[]
["7","Transport",null,null,null,9,34.5,28,63.8,36.200000000000003,95,30.4,32.1,92,102.9,91.1,119.1,115.6]
[]
["8","Communication",null,null,null,6.3,10.4,8.5,12.4,10.4,17.5,12.3,17.5,21.3,20.7,22.9,22.4,27.3]
[]
["9","Recreation and culture",null,null,null,18.3,47.9,32,84.6,32.5,85.4,39.5,46.9,73.5,93.6,95.1,89,95.9]
[]
["10","Education",null,null,null,"-","-",0.1,1.1000000000000001,1.1000000000000001,7.7,2.2000000000000002,12.5,9.9,17.2,23.5,14.2,9.1999999999999993]
[]
["11","Restaurants and hotels",null,null,null,7.6,23.7,15.8,43.3,24.1,58.1,21.4,35.5,48.2,58.5,55.3,79.400000000000006,70.2]
[]
["12","Miscellaneous goods and services",null,null,null,13.3,18.8,24.8,38.4,18.3,40.5,25.7,35,56.1,65.2,56.5,52.4,67]
[]
[]
["1-12","All expenditure groups",null,null,null,149.5,287.89999999999998,223.5,441.7,257.7,538.29999999999995,297.5,364.5,544.29999999999995,623.29999999999995,627.79999999999995,669.9,654.5]
[]
[]
["13","Other expenditure items",null,null,null,16.600000000000001,27.7,36.4,57,50.8,86.5,27.4,31.7,88.2,114.7,125.6,88.8,141.69999999999999]
[]
[]
["Total expenditure",null,null,null,null,166.2,315.7,260,498.7,308.5,624.70000000000005,324.89999999999998,396.3,632.5,738,753.4,758.8,796.2]
[]
[]
["Average weekly expenditure per person (£)"]
["Total expenditure",null,null,null,null,166.2,157.80000000000001,260,249.3,308.5,312.39999999999998,162.4,116.7,210.8,184.5,141.1,220.3,163.9]
[]
[]
["Note: The commodity and service categories are not comparable to those in publications before 2001-02."]
["Please see background notes for symbols and conventions used in this report."]
["1 Mainly dependent on state pensions and not economically active - see definitions in technical report."]
["2 Excluding mortgage interest payments, council tax and Northern Ireland rates."]
[]
[]
["Source: Office for National Statistics"]

{"sheet":"ONS 2018","index":16,"n_rows":55,"n_cols":27,"rows_kept":55,"cut":false,"hidden":true,"merged":[[21,6,21,16]]}
["Table A23"]
["Expenditure by household composition"]
["UK, financial year ending 2018"]
[]
[]
[null,null,null,null,null,"Retired households",null,null,null,"Non-retired",null,"Retired and non-retired households"]
[null,null,null,null,null,"State pension1",null,"Other retired",null,"One","Two","One adult",null,"Two adults",null,null,"Three or more adults",null,null,null,"One","Two","One adult",null,"Two adults"]
[null,null,null,null,null,"One","Two ","One","Two","person","adults","with","with","with","with","with","without","with",null,null,"person","adults","with","with","with","with","with"]
[null,null,null,null,null,"person","adults","person","adults"," ",null,"one","two","one","two","three","children","children",null,null," ",null,"one","two","one","two","three"]
[null,null,null,null,null,null,null,null,null,null,null,"child","or more","child","children","or more",null,null,null,null,null,null,"child","or more","child","children","or more"]
[null,null,null,null,null,null,null,null,null,null,null,null,"children",null,null,"children",null,null,null,null,null,null,null,"children",null,null,"children"]
[]
[null,null,null,null,null,null,null,null,null,null,null,null,null,null,null,null,null,null,"1","Food and non-alcoholic drinks",31.4,60.8,40.5,57.1,69.3,83.4,88.6]
["Weighted number of households (thousands)",null,null,null,null,750,440,2770,2780,3870,5890,680,610,2230,2650,740,2460,1290,"2","Alcoholic drinks, tobacco and narcotics",9.3000000000000007,15.1,4.7,7.1,11.2,12.3,13.3]
["Total number of households in sample",null,null,null,null,130,100,510,630,800,1190,140,140,440,540,160,410,210,"3","Clothing and footwear",9.8000000000000007,25.1,17.899999999999999,24.8,26.2,43.8,34.4]
["Total number of persons in sample",null,null,null,null,130,210,510,1260,800,2380,280,480,1310,2150,840,1380,1030,"4","Housing(net)2, fuel and power",70.3,84.1,85.2,63.3,86,89.1,100.6]
["Total number of adults in sample",null,null,null,null,130,210,510,1260,800,2380,140,140,880,1080,320,1380,710,"5","Household goods and services",26.9,49.5,35.6,23.5,53.3,46.7,51.2]
[null,null,null,null,null,null,null,null,null,null,null,null,null,null,null,null,null,null,"6","Health",5.5,7.1,1.3,4.2,5.4,5.9,6.6]
["Weighted average number of persons per household",null,null,null,null,1,2,1,2,1,2,2,3.4,3,4,5.3,3.4,5,"7","Transport",45.3,97.7,44.7,40.4,93.8,118.4,93.6]
[null,null,null,null,null,null,null,null,null,null,null,null,null,null,null,null,null,null,"8","Communication",11.6,19.600000000000001,14.8,15.5,21.3,22.6,23.8]
[null,null,null,null,null,null,null,null,null,null,null,null,null,null,null,null,null,null,"9","Recreation and culture",41.5,86.8,38.4,48.6,67.8,104.7,91.6]
["Commodity or service",null,null,null,null,null,"Average weekly household expenditure (£)",null,null,null,null,null,null,null,null,null,null,null,"10","Education",6.1,5.5,8.8000000000000007,8.1999999999999993,14.2,15.9,23.6]
[null,null,null,null,null,null,null,null,null,null,null,null,null,null,null,null,null,null,"11","Restaurants and hotels",27.7,63.6,25.6,27.7,52.4,65.7,62.7]
[null,null,null,null,null,null,null,null,null,null,null,null,null,null,null,null,null,null,"12","Miscellaneous goods and services",21.1,46.5,29.6,26,55.6,63.9,48.5]
["1","Food and non-alcoholic drinks",null,null,null,27.9,58.1,33.700000000000003,64.5,31.4,60.8,40.5,57.1,69.3,83.4,88.6,83.3,108.8]
["2","Alcoholic drinks, tobacco and narcotics",null,null,null,6.7,10.6,6,14,9.3000000000000007,15.1,4.7,7.1,11.2,12.3,13.3,21.2,15.9,"1-12","All expenditure groups",306.39999999999998,561.29999999999995,347.1,346.5,556.4,672.5,638.6]
["3","Clothing and footwear",null,null,null,5.8,10.1,7.3,18.899999999999999,9.8000000000000007,25.1,17.899999999999999,24.8,26.2,43.8,34.4,38.700000000000003,55.5]
["4","Housing(net)2, fuel and power",null,null,null,43.8,45.8,41.5,53.1,70.3,84.1,85.2,63.3,86,89.1,100.6,105.1,98.8,"13","Other expenditure items",47.1,99.8,42.6,40.6,97.8,110.6,103.3]
["5","Household goods and services",null,null,null,11,33.6,22.5,39,26.9,49.5,35.6,23.5,53.3,46.7,51.2,50.2,56.1]
["6","Health",null,null,null,2.9,7,3.5,11.5,5.5,7.1,1.3,4.2,5.4,5.9,6.6,9.3000000000000007,14.2,"Total expenditure",null,353.5,661.1,389.7,387,654.20000000000005,783.1,741.9]
["7","Transport",null,null,null,14.2,38.200000000000003,23.3,66.3,45.3,97.7,44.7,40.4,93.8,118.4,93.6,136.1,143.9]
["8","Communication",null,null,null,7.6,11.6,9.5,14.6,11.6,19.600000000000001,14.8,15.5,21.3,22.6,23.8,25.2,32]
["9","Recreation and culture",null,null,null,21.1,58.9,39,92.4,41.5,86.8,38.4,48.6,67.8,104.7,91.6,99.8,116]
["10","Education",null,null,null,":",":","..",1.4,6.1,5.5,8.8000000000000007,8.1999999999999993,14.2,15.9,23.6,22.8,12.2]
["11","Restaurants and hotels",null,null,null,11.5,28.1,17.7,43.6,27.7,63.6,25.6,27.7,52.4,65.7,62.7,79.599999999999994,83.7]
["12","Miscellaneous goods and services",null,null,null,16.600000000000001,26.5,30.2,42.1,21.1,46.5,29.6,26,55.6,63.9,48.5,56.7,75.7]
[]
["1-12","All expenditure groups",null,null,null,169.2,328.6,234.6,461.3,306.39999999999998,561.29999999999995,347.1,346.5,556.4,672.5,638.6,727.9,812.8]
[]
["13","Other expenditure items",null,null,null,23,36.1,37.5,65.8,47.1,99.8,42.6,40.6,97.8,110.6,103.3,88.9,97.3]
[]
["Total expenditure",null,null,null,null,192.2,364.7,272.10000000000002,527.1,353.5,661.1,389.7,387,654.20000000000005,783.1,741.9,816.8,910]
[]
[]
["Average weekly expenditure per person (£)"]
["Total expenditure",null,null,null,null,192.2,182.3,272.10000000000002,263.5,353.5,330.5,194.8,113,218.1,195.8,140.69999999999999,239.4,181.8]
[]
[]
["Note: The commodity and service categories are not comparable to those in publications before 2001-02."]
["Please see background notes for symbols and conventions used in this report."]
["1 Mainly dependent on state pensions and not economically active - see definitions in technical report."]
["2 Excluding mortgage interest payments, council tax and Northern Ireland rates."]
[]
[]
["Source: Office for National Statistics"]

{"sheet":"ONS expenditure breakdown A1","index":17,"n_rows":873,"n_cols":20,"rows_kept":873,"cut":false,"hidden":true,"merged":[[329,3,329,5],[334,3,334,5],[15,10,15,11]]}
["Table A1"]
["Components of household expenditure"]
["UK, financial year ending 2016"]
[]
[null,null,null,null,null,null,"Average weekly","Total","Recording","Percentage"]
[null,null,null,null,null,null,"expenditure","weekly","house-","standard "]
[null,null,null,null,null,null,"all house-","expenditure","holds","error (full"]
[null,null,null,null,null,null,"holds (£)","(£ million)","in sample","method)"]
[]
[]
["Total number of households",null,null,null,null,null,null,null,4920]
[]
[]
["Commodity or service",null,null,null,null," "]
[null,null,null,null,null,null,null,null,null,null,null,1,"Non Essential / Not required for basic standard of living","Total","% considered non -essential","Essential / Basic standard of living ","Esesential or Basic cost of living","Notes"]
[null,null,null,null,null,null,null,null,null,null,"ONS Category",null,"Non Essential / Not required for basic standard of living","Total","% considered non -essential","Essential / Basic standard of living ","Esesential or Basic cost of living","Notes",null,"% of Sample reporting this category of Expense"]
["1","Food and non-alcoholic drinks",null,null,null,null,56.8,1547,4890,0.9,1,{"$f":"B17","v":"Food and non-alcoholic drinks"},0,{"$f":"G17","v":56.8},0,1,"Essential",null,null,{"$f":"I17/$I$11","v":0.99390243902439024}]
[null,null,null,null,null,null,null,null,null,null,null,null,null,null,null,null,null,null,null,{"$f":"I18/$I$11","v":0}]
[1.1000000000000001,"Food ",null,null,null,null,52.2,1421,4880,1,null,{"$f":"B19","v":"Food "},0,null,null,null,null,null,null,0.99186991869918695]
[null,"1.1.1","Bread, rice and cereals",null,null,null,5.2,141,4770,1.2,null,null,null,null,null,null,null,null,null,0.96951219512195119]
[null,null,"1.1.1.1","Rice",null,null,0.4,12,1350,5.4,null,null,null,null,null,null,null,null,null,0.27439024390243905]
[null,null,"1.1.1.2","Bread",null,null,2.4,66,4580,1.2,null,null,null,null,null,null,null,null,null,0.93089430894308944]
[null,null,"1.1.1.3","Other breads and cereals",null,null,2.2999999999999998,63,3990,1.5,null,null,null,null,null,null,null,null,null,0.81097560975609762]
[null,"1.1.2","Pasta products",null,null,null,0.4,11,2000,2.7,null,null,null,null,null,null,null,null,null,0.4065040650406504]
[null,"1.1.3","Buns, cakes, biscuits etc",null,null,null,3.6,98,4380,1.5,null,null,null,null,null,null,null,null,null,0.8902439024390244]
[null,null,"1.1.3.1","Buns, crispbread and biscuits",null,null,2.2000000000000002,60,4070,1.6,null,null,null,null,null,null,null,null,null,0.82723577235772361]
[null,null,"1.1.3.2","Cakes and puddings",null,null,1.4,38,3170,2.1,null,null,null,null,null,null,null,null,null,0.64430894308943087]
[null,"1.1.4","Pastry (savoury)",null,null,null,0.8,23,1900,2.6,null,null,null,null,null,null,null,null,null,0.38617886178861788]
[null,null,null,null,null,null,null,null,null,0,null,null,null,null,null,null,null,null,null,0]
[null,"1.1.5","Beef (fresh, chilled or frozen)",null,null,null,1.9,53,2190,2.7,null,null,null,null,null,null,null,null,null,0.4451219512195122]
[null,"1.1.6","Pork (fresh, chilled or frozen)",null,null,null,0.6,16,1090,3.9,null,null,null,null,null,null,null,null,null,0.22154471544715448]
[null,"1.1.7","Lamb (fresh, chilled or frozen)",null,null,null,0.7,19,730,6,null,null,null,null,null,null,null,null,null,0.1483739837398374]
[null,"1.1.8","Poultry (fresh, chilled or frozen)",null,null,null,2.1,58,2570,2.1,null,null,null,null,null,null,null,null,null,0.52235772357723576]
[null,"1.1.9","Bacon and ham",null,null,null,0.9,24,2130,2.6,null,null,null,null,null,null,null,null,null,0.43292682926829268]
[null,"1.1.10","Other meats and meat preparations",null,null,null,6,164,4330,1.5,null,null,null,null,null,null,null,null,null,0.88008130081300817]
[null,null,"1.1.10.1","Sausages",null,null,0.8,23,2170,2.5,null,null,null,null,null,null,null,null,null,0.44105691056910568]
[null,null,"1.1.10.2","Offal, pate etc",null,null,0.1,3,590,5.9,null,null,null,null,null,null,null,null,null,0.11991869918699187]
[null,null,"1.1.10.3","Other preserved or processed meat and meat preparations",null,null,5.0999999999999996,138,4180,1.7,null,null,null,null,null,null,null,null,null,0.84959349593495936]
[null,null,"1.1.10.4","Other fresh, chilled or frozen edible meat",null,null,0,0,20,22,null,null,null,null,null,null,null,null,null,4.0650406504065045E-3]
[null,null,null,null,null,null,null,null,null,null,null,null,null,null,null,null,null,null,null,0]
[null,"1.1.11","Fish and fish products",null,null,null,2.6,71,3170,2.2000000000000002,null,null,null,null,null,null,null,null,null,0.64430894308943087]
[null,null,"1.1.11.1","Fish (fresh, chilled or frozen)",null,null,0.8,22,1230,3.9,null,null,null,null,null,null,null,null,null,0.25]
[null,null,"1.1.11.2","Seafood, dried, smoked or salted fish",null,null,0.6,17,1110,4.2,null,null,null,null,null,null,null,null,null,0.22560975609756098]
[null,null,"1.1.11.3","Other preserved or processed fish and seafood",null,null,1.2,32,2470,2.4,null,null,null,null,null,null,null,null,null,0.50203252032520329]
[null,null,null,null,null,null,null,null,null,null,null,null,null,null,null,null,null,null,null,0]
[null,"1.1.12","Milk",null,null,null,2.1,58,4470,1.8,null,null,null,null,null,null,null,null,null,0.90853658536585369]
[null,null,"1.1.12.1","Whole milk",null,null,0.4,11,1250,3.8,null,null,null,null,null,null,null,null,null,0.25406504065040653]
[null,null,"1.1.12.2","Low fat milk",null,null,1.4,39,3830,1.7,null,null,null,null,null,null,null,null,null,0.77845528455284552]
[null,null,"1.1.12.3","Preserved milk",null,null,0.3,8,330,9.1999999999999993,null,null,null,null,null,null,null,null,null,6.7073170731707321E-2]
[null,"1.1.13","Cheese and curd",null,null,null,1.9,51,3540,1.8,null,null,null,null,null,null,null,null,null,0.71951219512195119]
[null,"1.1.14","Eggs",null,null,null,0.7,18,2900,1.9,null,null,null,null,null,null,null,null,null,0.58943089430894313]
[null,"1.1.15","Other milk products",null,null,null,2.1,56,3780,1.7,null,null,null,null,null,null,null,null,null,0.76829268292682928]
[null,null,"1.1.15.1","Other milk products",null,null,0.9,26,2840,2.2000000000000002,null,null,null,null,null,null,null,null,null,0.57723577235772361]
[null,null,"1.1.15.2","Yoghurt",null,null,1.1000000000000001,30,2790,2.1,null,null,null,null,null,null,null,null,null,0.56707317073170727]
[null,null,null,null,null,null,null,null,null,null,null,null,null,null,null,null,null,null,null,0]
[null,"1.1.16","Butter",null,null,null,0.5,13,1630,3.1,null,null,null,null,null,null,null,null,null,0.33130081300813008]
[null,"1.1.17","Margarine, other vegetable fats and peanut butter",null,null,null,0.4,12,1980,2.2999999999999998,null,null,null,null,null,null,null,null,null,0.40243902439024393]
[null,"1.1.18","Cooking oils and fats",null,null,null,0.4,10,1140,13.9,null,null,null,null,null,null,null,null,null,0.23170731707317074]
[null,null,"1.1.18.1","Olive oil",null,null,0.1,4,430,6.2,null,null,null,null,null,null,null,null,null,8.7398373983739841E-2]
[null,null,"1.1.18.2","Edible oils and other edible animal fats",null,null,0.2,6,810,21,null,null,null,null,null,null,null,null,null,0.16463414634146342]
[null,null,null,null,null,null,null,null,null,null,null,null,null,null,null,null,null,null,null,0]
[null,"1.1.19","Fresh fruit",null,null,null,3.6,98,4150,1.7,null,null,null,null,null,null,null,null,null,0.8434959349593496]
[null,null,"1.1.19.1","Citrus fruits (fresh)",null,null,0.5,15,2240,2.7,null,null,null,null,null,null,null,null,null,0.45528455284552843]
[null,null,"1.1.19.2","Bananas (fresh)",null,null,0.5,13,3030,1.9,null,null,null,null,null,null,null,null,null,0.61585365853658536]
[null,null,"1.1.19.3","Apples (fresh)",null,null,0.6,15,2250,2.2999999999999998,null,null,null,null,null,null,null,null,null,0.45731707317073172]
[null,null,"1.1.19.4","Pears (fresh)",null,null,0.1,4,820,4.0999999999999996,null,null,null,null,null,null,null,null,null,0.16666666666666666]
[null,null,"1.1.19.5","Stone fruits (fresh)",null," ",0.5,15,1680,3.7,null,null,null,null,null,null,null,null,null,0.34146341463414637]
[null,null,"1.1.19.6","Berries (fresh)",null," ",1.4,37,2610,2.2000000000000002,null,null,null,null,null,null,null,null,null,0.53048780487804881]
[null,"1.1.20","Other fresh, chilled or frozen fruits",null,null,null,0.4,11,1440,3.4,null,null,null,null,null,null,null,null,null,0.29268292682926828]
[null,"1.1.21","Dried fruit and nuts",null,null,null,0.7,20,1770,3.3,null,null,null,null,null,null,null,null,null,0.3597560975609756]
[null,"1.1.22","Preserved fruit and fruit based products",null,null,null,0.2,4,780,4.9000000000000004,null,null,null,null,null,null,null,null,null,0.15853658536585366]
[null,null,null,null,null,null,null,null,null,null,null,null,null,null,null,null,null,null,null,0]
[null,"1.1.23","Fresh vegetables",null,null,null,4.0999999999999996,111,4450,1.6,null,null,null,null,null,null,null,null,null,0.90447154471544711]
[null,null,"1.1.23.1","Leaf and stem vegetables (fresh or chilled)",null,null,0.9,25,3170,2.2999999999999998,null,null,null,null,null,null,null,null,null,0.64430894308943087]
[null,null,"1.1.23.2","Cabbages (fresh or chilled)",null,null,0.4,10,2250,2.4,null,null,null,null,null,null,null,null,null,0.45731707317073172]
[null,null,"1.1.23.3","Vegetables grown for their fruit (fresh, chilled or frozen)",null,null,1.4,38,3720,1.7,null,null,null,null,null,null,null,null,null,0.75609756097560976]
[null,null,"1.1.23.4","Root crops, non-starchy bulbs and mushrooms (fresh, chilled or frozen)",null,null,1.4,39,3980,2,null,null,null,null,null,null,null,null,null,0.80894308943089432]
[null,null,null,null,null,null,null,null,null,null,null,null,null,null,null,null,null,null,null,0]
[null,null,null,null,null,null,null,null,null,null,null,null,null,null,null,null,null,null,null,0]
["Note: The commodity and service categories are not comparable with those in publications before 2001-02.",null,null,null,null,null,null,null,null,null,null,null,null,null,null,null,null,null,null,0]
["The numbering is sequential, it does not use actual COICOP codes.",null,null,null,null,null,null,null,null,null,null,null,null,null,null,null,null,null,null,0]
["Please see background notes for symbols and conventions used in this report.",null,null,null,null,null,null,null,null,null,null,null,null,null,null,null,null,null,null,{"$f":"I82/$I$11","v":0}]
[null,null,null,null,null,null,null,null,null,null,null,null,null,null,null,null,null,null,null,0]
[null,null,null,null,null,null,null,null,null,null,null,null,null,null,null,null,null,null,null,0]
[null,null,null,null,null,null,null,null,null,null,null,null,null,null,null,null,null,null,null,0]
["Table A1",null,null,null,null,null,null,null,null,null,null,null,null,null,null,null,null,null,null,0]
["Components of household expenditure (cont)",null,null,null,null,null,null,null,null,null,null,null,null,null,null,null,null,null,null,0]
["UK, financial year ending 2016",null,null,null,null,null,null,null,null,null,null,null,null,null,null,null,null,null,null,0]
[null,null,null,null,null,null,null,null,null,null,null,null,null,null,null,null,null,null,null,0]
[null,null,null,null,null,null,null,null,null,null,null,null,null,null,null,null,null,null,null,0]
[null,null,null,null,null,null,"Average weekly","Total","Recording","Percentage",null,null,null,null,null,null,null,null,null,{"$error":"#VALUE!"}]
[null,null,null,null,null,null,"expenditure","weekly","house-","standard ",null,null,null,null,null,null,null,null,null,{"$error":"#VALUE!"}]
[null,null,null,null,null,null,"all house-","expenditure","holds","error (full",null,null,null,null,null,null,null,null,null,{"$error":"#VALUE!"}]
[null,null,null,null,null,null,"holds (£)","(£ million)","in sample","method)",null,null,null,null,null,null,null,null,null,{"$error":"#VALUE!"}]
[null,null,null,null,null,null,null,null,null,null,null,null,null,null,null,null,null,null,null,0]
[null,null,null,null,null,null,null,null,null,null,null,null,null,null,null,null,null,null,null,0]
["Commodity or service",null,null,null,null," ",null,null,null,null,null,null,null,null,null,null,null,null,null,0]
[null,null,null,null,null,null,null,null,null,null,null,null,null,null,null,null,null,null,null,0]
[null,null,null,null,null,null,null,null,null,null,null,null,null,null,null,null,null,null,null,0]
[1,"Food and non-alcoholic drinks (continued)",null,null,null,null,null,null,null,null,null,null,null,null,null,null,null,null,null,0]
[null,null,null,null,null,null,null,null,null,null,null,null,null,null,null,null,null,null,null,0]
[null,"1.1.24","Dried vegetables",null,null,null,0.1,1,250,9.1,null,null,null,null,null,null,null,null,null,5.08130081300813E-2]
[null,"1.1.25","Other preserved or processed vegetables",null,null,null,1.4,39,3570,2,null,null,null,null,null,null,null,null,null,0.72560975609756095]
[null,"1.1.26","Potatoes",null,null,null,0.8,22,3060,1.8,null,null,null,null,null,null,null,null,null,0.62195121951219512]
[null,"1.1.27","Other tubers and products of tuber vegetables",null,null,null,1.6,43,3530,1.6,null,null,null,null,null,null,null,null,null,0.71747967479674801]
[null,null,null,null,null,null,null,null,null,null,null,null,null,null,null,null,null,null,null,0]
[null,"1.1.28","Sugar and sugar products",null,null,null,0.4,10,1690,3.2,null,null,null,null,null,null,null,null,null,0.3434959349593496]
[null,null,"1.1.28.1","Sugar",null,null,0.2,6,1330,3.8,null,null,null,null,null,null,null,null,null,0.27032520325203252]
[null,null,"1.1.28.2","Other sugar products",null,null,0.2,4,600,5.2,null,null,null,null,null,null,null,null,null,0.12195121951219512]
[null,"1.1.29","Jams, marmalades",null,null,null,0.3,8,1370,4.7,null,null,null,null,null,null,null,null,null,0.27845528455284552]
[null,"1.1.30","Chocolate",null,null,null,1.9,53,3170,3.1,null,null,null,null,null,null,null,null,null,0.64430894308943087]
[null,"1.1.31","Confectionery products",null,null,null,0.7,20,2350,2.7,null,null,null,null,null,null,null,null,null,0.47764227642276424]
[null,"1.1.32","Edible ices and ice cream",null,null,null,0.6,16,1670,2.9,null,null,null,null,null,null,null,null,null,0.33943089430894308]
[null,null,null,null,null,null,null,null,null,null,null,null,null,null,null,null,null,null,null,0]
[null,"1.1.33","Other food products",null,null,null,2.5,68,4040,1.9,null,null,null,null,null,null,null,null,null,0.82113821138211385]
[null,null,"1.1.33.1","Sauces, condiments",null,null,1.2,33,3280,1.8,null,null,null,null,null,null,null,null,null,0.66666666666666663]
[null,null,"1.1.33.2","Baker's yeast, dessert preparations, soups",null,null,1,28,2610,3.7,null,null,null,null,null,null,null,null,null,0.53048780487804881]
[null,null,"1.1.33.3","Salt, spices, culinary herbs and other food products",null,null,0.3,7,1130,4.9000000000000004,null,null,null,null,null,null,null,null,null,0.22967479674796748]
[null,null,null,null,null,null,null,null,null,null,null,null,null,null,null,null,null,null,null,0]
[1.2,"Non-alcoholic drinks",null,null,null,null,4.5999999999999996,126,4380,1.5,null,{"$f":"B120","v":"Non-alcoholic drinks"},0,null,null,null,null,null,null,0.8902439024390244]
[null,"1.2.1","Coffee",null,null,null,0.9,24,1630,3.5,null,null,null,null,null,null,null,null,null,0.33130081300813008]
[null,"1.2.2","Tea",null,null,null,0.5,13,1520,3.3,null,null,null,null,null,null,null,null,null,0.30894308943089432]
[null,"1.2.3","Cocoa and powdered chocolate",null,null,null,0.1,3,440,5.7,null,null,null,null,null,null,null,null,null,8.943089430894309E-2]
[null,"1.2.4","Fruit and vegetable juices",null,null,null,1,28,2610,2.2000000000000002,null,null,null,null,null,null,null,null,null,0.53048780487804881]
[null,"1.2.5","Mineral or spring waters",null,null,null,0.3,9,1320,4,null,null,null,null,null,null,null,null,null,0.26829268292682928]
[null,"1.2.6","Soft drinks (inc. fizzy and ready to drink fruit drinks)",null,null,null,1.8,50,3090,2.2000000000000002,null,null,null,null,null,null,null,null,null,0.62804878048780488]
[null,null,null,null,null,null,null,null,null,null,null,null,null,null,null,null,null,null,null,0]
[null,null,null,null,null,null,null,null,null,null,null,null,null,null,null,null,null,null,null,0]
[2,"Alcoholic drink, tobacco and narcotics",null,null,null,null,11.4,309,3010,2.2999999999999998,2,{"$f":"B129","v":"Alcoholic drink, tobacco and narcotics"},{"$f":"SUM(M131:M151)","v":6.468},{"$f":"G129","v":11.4},{"$f":"(M129/N129)","v":0.56736842105263152},0.4,"Basic "," Wouldn’t consider 100% essential, only 60% of households recorded spending on alcohol and 16% on tobacco and narcotics so have used this as basis for quantification to get 43% and then rounded down to 40% as expectation would be to reduce if in financial hardship",null,0.61178861788617889]
[null,null,null,null,null,null,null,null,null,null,null,null,null,null,null,null,null,null,null,0]
[2.1,"Alcoholic drinks",null,null,null,null,7.8,211,2660,2.4,null,{"$f":"B131","v":"Alcoholic drinks"},{"$f":"G131*46%","v":3.5880000000000001},null,null,null,null,"used % of households recording this expenditure as proxy for calculation (54%)",null,0.54065040650406504]
[null,"2.1.1","Spirits and liqueurs (brought home)",null,null,null,1.7,47,760,4.7,null,null,null,null,null,null,null,null,null,0.15447154471544716]
[null,null,null,null,null,null,null,null,null,null,null,null,null,null,null,null,null,null,null,0]
[null,"2.1.2","Wines, fortified wines (brought home)",null,null,null,4,108,1800,3.4,null,null,null,null,null,null,null,null,null,0.36585365853658536]
[null,null,"2.1.2.1","Wine from grape or other fruit (brought home)",null,null,3.3,91,1630,3.7,null,null,null,null,null,null,null,null,null,0.33130081300813008]
[null,null,"2.1.2.2","Fortified wine (brought home)",null,null,0.2,4,140,12.6,null,null,null,null,null,null,null,null,null,2.8455284552845527E-2]
[null,null,"2.1.2.3","Champagne and sparkling wines (brought home)",null,null,0.5,13,340,7.7,null,null,null,null,null,null,null,null,null,6.910569105691057E-2]
[null,null,null,null,null,null,null,null,null,null,null,null,null,null,null,null,null,null,null,0]
[null,"2.1.3","Beer, lager, ciders and perry (brought home)",null,null,null,2,55,1480,3.5,null,null,null,null,null,null,null,null,null,0.30081300813008133]
[null,null,"2.1.3.1","Beer and lager (brought home)",null,null,1.7,45,1220,3.9,null,null,null,null,null,null,null,null,null,0.24796747967479674]
[null,null,"2.1.3.2","Ciders and perry (brought home)",null,null,0.4,10,470,7,null,null,null,null,null,null,null,null,null,9.5528455284552852E-2]
[null,null,null,null,null,null,null,null,null,null,null,null,null,null,null,null,null,null,null,0]
[null,"2.1.4","Alcopops (brought home)",null,null,null,0,1,80,17.899999999999999,null,null,null,null,null,null,null,null,null,1.6260162601626018E-2]
[null,null,null,null,null,null,null,null,null,null,null,null,null,null,null,null,null,null,null,0]
[2.2000000000000002,"Tobacco and narcotics1",null,null,null,null,3.6,98,790,5.0999999999999996,null,{"$f":"B145","v":"Tobacco and narcotics1"},{"$f":"G145*80%","v":2.8800000000000003},null,null,null,null,"used % of households recording this expenditure as proxy for calculation (16%)",null,0.16056910569105692]
[null,"2.2.1","Cigarettes",null,null,null,2.8,77,640,5.9,null,null,null,null,null,null,null,null,null,{"$f":"I146/$I$11","v":0.13008130081300814}]
[null,null,null,null,null,null,null,null,null,null,null,null,null,null,null,null,null,null,null,0]
[null,"2.2.2","Cigars, other tobacco products and narcotics",null,null,null,0.8,21,310,8.1999999999999993,null,null,null,null,null,null,null,null,null,6.3008130081300809E-2]
[null,null,"2.2.2.1","Cigars",null,null,0,1,10,36.1,null,null,null,null,null,null,null,null,null,2.0325203252032522E-3]
[null,null,"2.2.2.2","Other tobacco",null,null,0.7,20,300,8.1,null,null,null,null,null,null,null,null,null,6.097560975609756E-2]
[null,null,"2.2.2.3","Narcotics",null,null,"-","-","-","-",null,null,null,null,null,null,null,null,null,{"$error":"#VALUE!"}]
[null,null,null,null,null,null,null,null,null,null,null,null,null,null,null,null,null,null,null,0]
[null,null,null,null,null,null,null,null,null,null,null,null,null,null,null,null,null,null,null,0]
["3","Clothing and footwear",null,null,null,null,23.5,638,3220,2.8,3,{"$f":"B154","v":"Clothing and footwear"},{"$f":"SUM(M156:M206)","v":11.75},{"$f":"G154","v":23.5},{"$f":"(M154/N154)","v":0.5},0.5,"Basic ","Only consider 50% as essential for basic quality of life as a) not all the categories would apply and b) in times of financial hardship it is likely thay this could be reduced by 50%",null,0.65447154471544711]
[null,null,null,null,null,null,null,null,null,null,null,null,null,null,null,null,null,null,null,0]
[3.1,"Clothing",null,null,null,null,18.899999999999999,513,3040,3.1,null,{"$f":"B156","v":"Clothing"},{"$f":"G156*50%","v":9.4499999999999993},null,null,null,null,null,null,0.61788617886178865]
[null,"3.1.1","Men's outer garments",null,null,null,4.8,131,960,5.2,null,null,null,null,null,null,null,null,null,0.1951219512195122]
[null,"3.1.2","Men's under garments",null,null,null,0.6,16,420,7.4,null,null,null,null,null,null,null,null,null,8.5365853658536592E-2]
[null,"3.1.3","Women's outer garments",null,null,null,8.3000000000000007,226,1770,4.5999999999999996,null,null,null,null,null,null,null,null,null,0.3597560975609756]
[null,"3.1.4","Women's under garments",null,null,null,1.1000000000000001,30,820,4.8,null,null,null,null,null,null,null,null,null,0.16666666666666666]
[null,"3.1.5","Boys' outer garments (5-15)",null,null,null,0.9,25,370,8.3000000000000007,null,null,null,null,null,null,null,null,null,7.5203252032520332E-2]
[null,"3.1.6","Girls' outer garments (5-15)",null,null,null,1,26,440,7,null,null,null,null,null,null,null,null,null,8.943089430894309E-2]
[null,"3.1.7","Infants' outer garments (under 5)",null,null,null,0.6,17,340,7.8,null,null,null,null,null,null,null,null,null,6.910569105691057E-2]
[null,"3.1.8","Children's under garments (under 16)",null,null,null,0.4,11,430,6.7,null,null,null,null,null,null,null,null,null,8.7398373983739841E-2]
[null,null,null,null,null,null,null,null,null,null,null,null,null,null,null,null,null,null,null,0]
[null,null,null,null,null,null,null,null,null,null,null,null,null,null,null,null,null,null,null,0]
["Note: The commodity and service categories are not comparable with those in publications before 2001-02.",null,null,null,null,null,null,null,null,null,null,null,null,null,null,null,null,null,null,0]
["The numbering is sequential, it does not use actual COICOP codes.",null,null,null,null,null,null,null,null,null,null,null,null,null,null,null,null,null,null,0]
["Please see background notes for symbols and conventions used in this report.",null,null,null,null,null,null,null,null,null,null,null,null,null,null,null,null,null,null,0]
["1 Changes were made to the recording of e-cigarettes in 2015.",null,null,null,null,null,null,null,null,null,null,null,null,null,null,null,null,null,null,0]
[null,null,null,null,null,null,null,null,null,null,null,null,null,null,null,null,null,null,null,0]
[null,null,null,null,null,null,null,null,null,null,null,null,null,null,null,null,null,null,null,0]
[null,null,null,null,null,null,null,null,null,null,null,null,null,null,null,null,null,null,null,0]
[null,null,null,null,null,null,null,null,null,null,null,null,null,null,null,null,null,null,null,0]
["Table A1",null,null,null,null,null,null,null,null,null,null,null,null,null,null,null,null,null,null,0]
["Components of household expenditure (cont)",null,null,null,null,null,null,null,null,null,null,null,null,null,null,null,null,null,null,0]
["UK, financial year ending 2016",null,null,null,null,null,null,null,null,null,null,null,null,null,null,null,null,null,null,0]
[null,null,null,null,null,null,null,null,null,null,null,null,null,null,null,null,null,null,null,0]
[null,null,null,null,null,null,null,null,null,null,null,null,null,null,null,null,null,null,null,0]
[null,null,null,null,null,null,"Average weekly","Total","Recording","Percentage",null,null,null,null,null,null,null,null,null,{"$error":"#VALUE!"}]
[null,null,null,null,null,null,"expenditure","weekly","house-","standard ",null,null,null,null,null,null,null,null,null,{"$error":"#VALUE!"}]
[null,null,null,null,null,null,"all house-","expenditure","holds","error (full",null,null,null,null,null,null,null,null,null,{"$error":"#VALUE!"}]
[null,null,null,null,null,null,"holds (£)","(£ million)","in sample","method)",null,null,null,null,null,null,null,null,null,{"$error":"#VALUE!"}]
[null,null,null,null,null,null,null,null,null,null,null,null,null,null,null,null,null,null,null,0]
[null,null,null,null,null,null,null,null,null,null,null,null,null,null,null,null,null,null,null,0]
["Commodity or service",null,null,null,null," ",null,null,null,null,null,null,null,null,null,null,null,null,null,0]
[null,null,null,null,null,null,null,null,null,null,null,null,null,null,null,null,null,null,null,0]
["3","Clothing and footwear (continued)",null,null,null,null,null,null,null,null,null,null,null,null,null,null,null,null,null,0]
[null,null,null,null,null,null,null,null,null,null,null,null,null,null,null,null,null,null,null,0]
[null,"3.1.9","Accessories",null,null,null,0.7,19,650,7.2,null,null,null,null,null,null,null,null,null,0.13211382113821138]
[null,null,"3.1.9.1","Men's accessories",null,null,0.2,6,230,9.1,null,null,null,null,null,null,null,null,null,4.6747967479674794E-2]
[null,null,"3.1.9.2","Women's accessories",null,null,0.3,9,320,11.9,null,null,null,null,null,null,null,null,null,6.5040650406504072E-2]
[null,null,"3.1.9.3","Children's accessories",null,null,0.1,3,150,13,null,null,null,null,null,null,null,null,null,3.048780487804878E-2]
[null,null,"3.1.9.4","Protective head gear (crash helmets)",null,null,0,1,10,32.1,null,null,null,null,null,null,null,null,null,2.0325203252032522E-3]
[null,null,null,null,null,null,null,null,null,null,null,null,null,null,null,null,null,null,null,0]
[null,"3.1.10","Haberdashery, clothing materials and clothing hire",null,null,null,0.2,5,230,11.9,null,null,null,null,null,null,null,null,null,4.6747967479674794E-2]
[null,null,null,null,null,null,null,null,null,null,null,null,null,null,null,null,null,null,null,0]
[null,"3.1.11","Dry cleaners, laundry and dyeing",null,null,null,0.2,6,130,11.5,null,null,null,null,null,null,null,null,null,2.6422764227642278E-2]
[null,null,"3.1.11.1","Dry cleaners and dyeing",null,null,0.2,5,100,13.1,null,null,null,null,null,null,null,null,null,2.032520325203252E-2]
[null,null,"3.1.11.2","Laundry, launderettes",null,null,0,1,30,19.100000000000001,null,null,null,null,null,null,null,null,null,6.0975609756097563E-3]
[null,null,null,null,null,null,null,null,null,null,null,null,null,null,null,null,null,null,null,0]
[3.2,"Footwear",null,null,null,null,4.5999999999999996,125,1290,3.8,null,{"$f":"B202","v":"Footwear"},{"$f":"G202*50%","v":2.2999999999999998},null,null,null,null,null,null,0.26219512195121952]
[null,"3.2.1","Footwear for men",null,null,null,1.6,43,380,6.3,null,null,null,null,null,null,null,null,null,7.7235772357723581E-2]
[null,"3.2.2","Footwear for women",null,null,null,2.2000000000000002,59,740,5.2,null,null,null,null,null,null,null,null,null,0.15040650406504066]
[null,"3.2.3","Footwear for children (5 to 15 years) and infants (under 5)",null,null,null,0.8,21,350,7.8,null,null,null,null,null,null,null,null,null,7.113821138211382E-2]
[null,"3.2.4","Repair and hire of footwear",null,null,null,0.1,1,30,24.5,null,null,null,null,null,null,null,null,null,6.0975609756097563E-3]
[null,null,null,null,null,null,null,null,null,null,null,null,null,null,null,null,null,null,null,0]
[null,null,null,null,null,null,null,null,null,null,null,null,null,null,null,null,null,null,null,0]
[4,"Housing(net)2, fuel and power",null,null,null,null,72.5,1973,4910,1.7,4,{"$f":"B209","v":"Housing(net)2, fuel and power"},{"$f":"M211+M217+M223+M228","v":35.700000000000003},{"$f":"G209","v":72.5},{"$f":"(M209/N209)","v":0.49241379310344829},0.5,"Essential","For a Mortgage it is not likely that Rent would apply and this category also includes some non essential mainteneance and alternative fuels  which are unlikely to be required in addition to main fuels (Gas & Electricity)",null,0.99796747967479671]
[null,null,null,null,null,null,null,null,null,null,null,null,null,null,null,null,null,null,null,{"$f":"I210/$I$11","v":0}]
[4.0999999999999996,"Actual rentals for housing",null,null,null,null,48.6,1322,1610,2.6,null,{"$f":"B211","v":"Actual rentals for housing"},{"$f":"SUM(M212:M216)","v":32.5},null,null,null,"Excluded","Exclude net rent - expect to be replaced with Mortgage",null,0.32723577235772355]
[null,"4.1.1","Gross rent",null,null,null,48.3,1316,1600,2.6,null,null,null,null,null,null,null,null,null,0.32520325203252032]
[null,"4.1.2","less housing benefit, rebates and allowances received",null,null,null,15.9,432,970,4.2,null,null,null,null,null,null,null,null,null,0.19715447154471544]
[null,"4.1.3","Net rent3",null,null,null,32.5,884,1330,3.4,null,null,{"$f":"G214","v":32.5},null,null,null,null,null,null,0.27032520325203252]
[null,"4.1.4","Second dwelling - rent",null,null,null,0.2,6,10,34,null,null,null,null,null,null,null,null,null,2.0325203252032522E-3]
[null,null,null,null,null,null,null,null,null,null,null,null,null,null,null,null,null,null,null,0]
[4.2,"Maintenance and repair of dwelling",null,null,null,null,7.6,207,1990,6.5,null,{"$f":"B217","v":"Maintenance and repair of dwelling"},{"$f":"SUM(M218:M221)","v":1.9},null,null,null,"Excluded","Exclude non essential maintenace , wall paper, paint, timber and equipment hire",null,0.40447154471544716]
[null,"4.2.1","Central heating repairs",null,null,null,1.1000000000000001,30,1120,7.9,null,null,null,null,null,null,null,null,null,0.22764227642276422]
[null,"4.2.2","House maintenance etc",null,null,null,4.5999999999999996,126,910,9.1,null,null,null,null,null,null,null,null,null,0.18495934959349594]
[null,"4.2.3","Paint, wallpaper, timber",null,null,null,1.2,32,370,9.4,null,null,{"$f":"G220","v":1.2},null,null,null,null,null,null,7.5203252032520332E-2]
[null,"4.2.4","Equipment hire, small materials",null,null,null,0.7,18,350,14.3,null,null,{"$f":"G221","v":0.7},null,null,null,null,null,null,7.113821138211382E-2]
[null,null,null,null,null,null,null,null,null,null,null,null,null,null,null,null,null,null,null,0]
[4.3,"Water supply and miscellaneous services relating to the dwelling",null,null,null,null,8.9,242,4740,1.6,null,{"$f":"B223","v":"Water supply and miscellaneous services relating to the dwelling"},{"$f":"SUM(M224:M227)","v":0.1},null,null,null,"Excluded","Exclude refuse collection - included in Council Tax / skip hire - non essential ",null,0.96341463414634143]
[null,"4.3.1","Water charges",null,null,null,7.4,201,4710,0.7,null,null,null,null,null,null,null,null,null,0.95731707317073167]
[null,"4.3.2","Other regular housing payments including service charge for rent",null,null,null,1.4,39,490,9.3000000000000007,null,null,null,null,null,null,null,null,null,9.959349593495935E-2]
[null,"4.3.3","Refuse collection, including skip hire",null,null,null,0.1,2,30,52.9,null,null,{"$f":"G226","v":0.1},null,null,null,"Excluded","This is included in council tax",null,6.0975609756097563E-3]
[null,null,null,null,null,null,null,null,null,null,null,null,null,null,null,null,null,null,null,0]
[4.4000000000000004,"Electricity, gas and other fuels",null,null,null,null,23.3,634,4880,0.9,null,{"$f":"B228","v":"Electricity, gas and other fuels"},{"$f":"SUM(M229:M235)","v":1.2},null,null,null,"Essential","Alternative Fuels unlikely to be required as well as gas and Electricity so this would likely be an either or",null,0.99186991869918695]
[null,"4.4.1","Electricity",null,null,null,11.5,312,4870,1.1000000000000001,null,null,null,null,null,null,null,null,null,0.98983739837398377]
[null,"4.4.2","Gas",null,null,null,10.7,291,4130,1.4,null,null,null,null,null,null,null,null,null,0.83943089430894313]
[null,null,null,null,null,null,null,null,null,null,null,null,null,null,null,null,null,null,null,0]
[null,"4.4.3","Other fuels",null,null,null,1.2,32,320,8.3000000000000007,null,null,{"$f":"G232","v":1.2},null,null,null,"Excluded","Unlikely to be required as well as other fuels",null,6.5040650406504072E-2]
[null,null,"4.4.3.1","Coal and coke",null,null,0.2,4,80,18.899999999999999,null,null,null,null,null,null,null,null,null,1.6260162601626018E-2]
[null,null,"4.4.3.2","Oil for central heating",null,null,0.9,24,220,8.5,null,null,null,null,null,null,null,null,null,4.4715447154471545E-2]
[null,null,"4.4.3.3","Paraffin, wood, peat, hot water etc",null,null,0.1,3,60,27.2,null,null,null,null,null,null,null,null,null,1.2195121951219513E-2]
[null,null,null,null,null,null,null,null,null,null,null,null,null,null,null,null,null,null,null,0]
[null,null,null,null,null,null,null,null,null,null,null,null,null,null,null,null,null,null,null,0]
[5,"Household goods and services ",null,null,null,null,35.5,965,4560,4.0999999999999996,5,{"$f":"B238","v":"Household goods and services "},{"$f":"M240+M250+M282+M294+M300+M307","v":22.9},{"$f":"G238","v":35.5},{"$f":"M238/N238","v":0.64507042253521119},0.45,"Basic ","Given such a small abount being considered required for a basic standard of living ( for clleaning products/ detergent) then this can be added to the Food and Groceries as people are likely to include in here as they are bought in the usual shopping with additional 30% being factored into the surplus income % for furniture and appliances considered to be basic standard of living costs",null,0.92682926829268297]
[null,null,null,null,null,null,null,null,null,null,null,null,null,null,{"$error":"#DIV/0!"},null,null,null,null,0]
[5.0999999999999996,"Furniture and furnishings, carpets and other floor coverings",null,null,null,null,21.2,576,2090,6.6,null,{"$f":"B240","v":"Furniture and furnishings, carpets and other floor coverings"},{"$f":"SUM(M241:M248)","v":13.3},null,null,null,"Excluded","Exclude fancy decorative goods, garden furniture, soft and hard floor coverings as in a period of financial hardhip the replacement of such items can be postponed",null,0.42479674796747968]
[null,"5.1.1","Furniture and furnishings",null,null,null,17.399999999999999,473,1870,7.1,null,null,null,null,{"$error":"#DIV/0!"},null,null,null,null,0.38008130081300812]
[null,null,"5.1.1.1","Furniture",null,null,15.8,429,1390,7.7,null,null,{"$f":"G242*50%","v":7.9},null,{"$error":"#DIV/0!"},null,null,null,null,0.28252032520325204]
[null,null,"5.1.1.2","Fancy, decorative goods",null,null,1.1000000000000001,31,720,8.1999999999999993,null,null,{"$f":"G243","v":1.1000000000000001},null,{"$error":"#DIV/0!"},null,null,null,null,0.14634146341463414]
[null,null,"5.1.1.3","Garden furniture",null,null,0.5,13,40,38,null,null,{"$f":"G244","v":0.5},null,{"$error":"#DIV/0!"},null,null,null,null,8.130081300813009E-3]
[null,null,null,null,null,null,null,null,null,null,null,null,null,null,{"$error":"#DIV/0!"},null,null,null,null,0]
[null,"5.1.2","Floor coverings",null,null,null,3.8,103,600,11.5,null,null,{"$f":"G246","v":3.8},null,{"$error":"#DIV/0!"},null,null,null,null,0.12195121951219512]
[null,null,"5.1.2.1","Soft floor coverings",null,null,3,83,570,8.8000000000000007,null,null,null,null,{"$error":"#DIV/0!"},null,null,null,null,0.11585365853658537]
[null,null,"5.1.2.2","Hard floor coverings",null,null,0.7,20,40,46.1,null,null,null,null,{"$error":"#DIV/0!"},null,null,null,null,8.130081300813009E-3]
[null,null,null,null,null,null,null,null,null,null,null,null,null,null,{"$error":"#DIV/0!"},null,null,null,null,0]
[5.2,"Household textiles",null,null,null,null,1.9,51,940,7.2,null,{"$f":"B250","v":"Household textiles"},{"$f":"G250","v":1.9},null,null,null,"Excluded","Exclude textiles - replacement could be postponed if needed",null,0.1910569105691057]
[null,"5.2.1","Bedroom textiles, including duvets and pillows",null,null,null,0.8,22,380,8.9,null,null,null,null,{"$error":"#DIV/0!"},null,null,null,null,7.7235772357723581E-2]
[null,"5.2.2","Other household textiles, including cushions, towels, curtains",null,null,null,1.1000000000000001,29,940,10.3,null,null,null,null,{"$error":"#DIV/0!"},null,null,null,null,0.1910569105691057]
[null,null,null,null,null,null,null,null,null,null,null,null,null,null,{"$error":"#DIV/0!"},null,null,null,null,0]
[null,null,null,null,null,null,null,null,null,null,null,null,null,null,{"$error":"#DIV/0!"},null,null,null,null,0]
["Note: The commodity and service categories are not comparable with those in publications before 2001-02.",null,null,null,null,null,null,null,null,null,null,null,null,null,{"$error":"#DIV/0!"},null,null,null,null,0]
["The numbering is sequential, it does not use actual COICOP codes.",null,null,null,null,null,null,null,null,null,null,null,null,null,{"$error":"#DIV/0!"},null,null,null,null,0]
["Please see background notes for symbols and conventions used in this report.",null,null,null,null,null,null,null,null,null,null,null,null,null,{"$error":"#DIV/0!"},null,null,null,null,0]
["2 Excluding mortgage interest payments, council tax and Northern Ireland rates.",null,null,null,null,null,null,null,null,null,null,null,null,null,{"$error":"#DIV/0!"},null,null,null,null,0]
["3 The figure included in total expenditure is net rent as opposed to gross rent.",null,null,null,null,null,null,null,null,null,null,null,null,null,{"$error":"#DIV/0!"},null,null,null,null,0]
[null,null,null,null,null,null,null,null,null,null,null,null,null,null,{"$error":"#DIV/0!"},null,null,null,null,0]
[null,null,null,null,null,null,null,null,null,null,null,null,null,null,{"$error":"#DIV/0!"},null,null,null,null,0]
[null,null,null,null,null,null,null,null,null,null,null,null,null,null,{"$error":"#DIV/0!"},null,null,null,null,0]
[null,null,null,null,null,null,null,null,null,null,null,null,null,null,{"$error":"#DIV/0!"},null,null,null,null,0]
[null,null,null,null,null,null,null,null,null,null,null,null,null,null,{"$error":"#DIV/0!"},null,null,null,null,0]
[null,null,null,null,null,null,null,null,null,null,null,null,null,null,{"$error":"#DIV/0!"},null,null,null,null,0]
[null,null,null,null,null,null,null,null,null,null,null,null,null,null,{"$error":"#DIV/0!"},null,null,null,null,0]
["Table A1",null,null,null,null,null,null,null,null,null,null,null,null,null,{"$error":"#DIV/0!"},null,null,null,null,0]
["Components of household expenditure (cont)",null,null,null,null,null,null,null,null,null,null,null,null,null,{"$error":"#DIV/0!"},null,null,null,null,0]
["UK, financial year ending 2016",null,null,null,null,null,null,null,null,null,null,null,null,null,{"$error":"#DIV/0!"},null,null,null,null,0]
[null,null,null,null,null,null,null,null,null,null,null,null,null,null,{"$error":"#DIV/0!"},null,null,null,null,0]
[null,null,null,null,null,null,null,null,null,null,null,null,null,null,{"$error":"#DIV/0!"},null,null,null,null,0]
[null,null,null,null,null,null,"Average weekly","Total","Recording","Percentage",null,null,null,null,{"$error":"#DIV/0!"},null,null,null,null,{"$error":"#VALUE!"}]
[null,null,null,null,null,null,"expenditure","weekly","house-","standard ",null,null,null,null,{"$error":"#DIV/0!"},null,null,null,null,{"$error":"#VALUE!"}]
[null,null,null,null,null,null,"all house-","expenditure","holds","error (full",null,null,null,null,{"$error":"#DIV/0!"},null,null,null,null,{"$f":"I274/$I$11","v":{"$error":"#VALUE!"}}]
[null,null,null,null,null,null,"holds (£)","(£ million)","in sample","method)",null,null,null,null,{"$error":"#DIV/0!"},null,null,null,null,{"$error":"#VALUE!"}]
[null,null,null,null,null,null,null,null,null,null,null,null,null,null,{"$error":"#DIV/0!"},null,null,null,null,0]
[null,null,null,null,null,null,null,null,null,null,null,null,null,null,{"$error":"#DIV/0!"},null,null,null,null,0]
["Commodity or service",null,null,null,null," ",null,null,null,null,null,null,null,null,{"$error":"#DIV/0!"},null,null,null,null,0]
[null,null,null,null,null,null,null,null,null,null,null,null,null,null,{"$error":"#DIV/0!"},null,null,null,null,0]
[5,"Household goods and services (continued) ",null,null,null,null,null,null,null,null,null,null,null,null,{"$error":"#DIV/0!"},null,null,null,null,0]
[null,null,null,null,null,null,null,null,null,null,null,null,null,null,{"$error":"#DIV/0!"},null,null,null,null,0]
[5.3,"Household appliances",null,null,null,null,2.4,66,400,8.8000000000000007,null,{"$f":"B282","v":"Household appliances"},null,null,null,null,"Basic","Household appliance considered a requirement for Basic Standard of Living",null,8.1300813008130079E-2]
[null,"5.3.1","Gas cookers",null,null,null,0.1,2,"..",47.8,null,null,null,null,{"$error":"#DIV/0!"},null,null,null,null,{"$error":"#VALUE!"}]
[null,"5.3.2","Electric cookers, combined gas/electric cookers",null,null,null,0.2,5,30,42,null,null,null,null,{"$error":"#DIV/0!"},null,null,null,null,6.0975609756097563E-3]
[null,"5.3.3","Clothes washing machines and drying machines",null,null,null,0.4,12,50,22.8,null,null,null,null,{"$error":"#DIV/0!"},null,null,null,null,1.016260162601626E-2]
[null,"5.3.4","Refrigerators, freezers and fridge-freezers",null,null,null,0.2,5,30,33.5,null,null,null,null,{"$error":"#DIV/0!"},null,null,null,null,6.0975609756097563E-3]
[null,"5.3.5","Other major electrical appliances, dishwashers, micro-waves",null,null,null,null,null,null,null,null,null,null,null,{"$error":"#DIV/0!"},null,null,null,null,0]
[null,null,"vacuum cleaners, heaters etc",null,null,null,0.9,23,140,12.7,null,null,null,null,{"$error":"#DIV/0!"},null,null,null,null,2.8455284552845527E-2]
[null,"5.3.6","Fire extinguisher, water softener, safes etc",null,null,null,0,0,"..",93,null,null,null,null,{"$error":"#DIV/0!"},null,null,null,null,{"$error":"#VALUE!"}]
[null,"5.3.7","Small electric household appliances, excluding hairdryers",null,null,null,0.5,14,160,14,null,null,null,null,{"$error":"#DIV/0!"},null,null,null,null,3.2520325203252036E-2]
[null,"5.3.8","Repairs to gas and electrical appliances and spare parts",null,null,null,0.2,5,30,23.1,null,null,null,null,{"$error":"#DIV/0!"},null,null,null,null,6.0975609756097563E-3]
[null,"5.3.9","Rental/hire of major household appliances",null,null,null,0,0,"..",43.6,null,null,null,null,{"$error":"#DIV/0!"},null,null,null,null,{"$error":"#VALUE!"}]
[null,null,null,null,null,null,null,null,null,null,null,null,null,null,{"$error":"#DIV/0!"},null,null,null,null,0]
[5.4,"Glassware, tableware and household utensils",null,null,null,null,1.8,48,1570,5.3,null,{"$f":"B294","v":"Glassware, tableware and household utensils"},{"$f":"G294","v":1.8},null,null,null,"Excluded","Exclude - replacement could be postponed if needed",null,0.31910569105691056]
[null,"5.4.1","Glassware, china, pottery, cutlery and silverware",null,null,null,0.6,16,640,8.9,null,null,null,null,{"$error":"#DIV/0!"},null,null,null,null,0.13008130081300814]
[null,"5.4.2","Kitchen and domestic utensils",null,null,null,0.7,20,870,7.3,null,null,null,null,{"$error":"#DIV/0!"},null,null,null,null,0.17682926829268292]
[null,"5.4.3","Repair of glassware, tableware and household utensils",null,null,null,0,0,"..",90.5,null,null,null,null,{"$error":"#DIV/0!"},null,null,null,null,{"$error":"#VALUE!"}]
[null,"5.4.4","Storage and other durable household articles",null,null,null,0.4,12,510,6.9,null,null,null,null,{"$error":"#DIV/0!"},null,null,null,null,0.10365853658536585]
[null,null,null,null,null,null,null,null,null,null,null,null,null,null,{"$error":"#DIV/0!"},null,null,null,null,0]
[5.5,"Tools and equipment for house and garden",null,null,null,null,2.2000000000000002,59,1440,5.7,null,{"$f":"B300","v":"Tools and equipment for house and garden"},{"$f":"G300","v":2.2000000000000002},null,null,null,"Excluded","Exclude - replacement could be postponed if needed",null,0.29268292682926828]
[null,"5.5.1","Electrical tools",null,null,null,0.3,8,70,17.600000000000001,null,null,null,null,{"$error":"#DIV/0!"},null,null,null,null,1.4227642276422764E-2]
[null,"5.5.2","Garden tools, equipment and accessories eg lawn mowers etc",null,null,null,0.5,13,270,14,null,null,null,null,{"$f":"M302/N302","v":{"$error":"#DIV/0!"}},null,null,null,null,5.4878048780487805E-2]
[null,"5.5.3","Small tools",null,null,null,0.4,10,340,10.5,null,null,null,null,{"$error":"#DIV/0!"},null,null,null,null,6.910569105691057E-2]
[null,"5.5.4","Door, electrical and other fittings",null,null,null,0.5,13,350,13.9,null,null,null,null,{"$error":"#DIV/0!"},null,null,null,null,7.113821138211382E-2]
[null,"5.5.5","Electrical consumables",null,null,null,0.6,15,850,6.4,null,null,null,null,{"$error":"#DIV/0!"},null,null,null,null,0.17276422764227642]
[null,null,null,null,null,null,null,null,null,null,null,null,null,null,{"$error":"#DIV/0!"},null,null,null,null,0]
[5.6,"Goods and services for routine household maintenance",null,null,null,null,6.1,166,4260,3.7,null,{"$f":"B307","v":"Goods and services for routine household maintenance"},{"$f":"SUM(M308:M321)","v":3.6999999999999997},null,null,null,"Essential","All Included as essential - Cleaning products etc",null,0.86585365853658536]
[null,"5.6.1","Cleaning materials",null,null,null,2.4,64,3370,2.2999999999999998,null,null,null,null,{"$error":"#DIV/0!"},null,null,null,null,0.68495934959349591]
[null,null,"5.6.1.1","Detergents, washing-up liquid, washing powder",null,null,1,28,2110,3.5,null,null,null,null,{"$error":"#DIV/0!"},null,null,null,null,0.42886178861788615]
[null,null,"5.6.1.2","Disinfectants, polishes, other cleaning materials etc",null,null,1.3,36,2810,2.5,null,null,null,null,{"$error":"#DIV/0!"},null,null,null,null,0.57113821138211385]
[null,null,null,null,null,null,null,null,null,null,null,null,null,null,{"$error":"#DIV/0!"},null,null,null,null,0]
[null,"5.6.2","Household goods and hardware",null,null,null,1.4,38,3520,2.6,null,null,{"$f":"G312","v":1.4},null,{"$error":"#DIV/0!"},null,null,null,null,0.71544715447154472]
[null,null,"5.6.2.1","Kitchen disposables",null,null,0.8,22,3190,2.5,null,null,null,null,{"$error":"#DIV/0!"},null,null,null,null,0.64837398373983735]
[null,null,"5.6.2.2","Household hardware and appliances, matches",null,null,0.3,8,560,7.4,null,null,null,null,{"$error":"#DIV/0!"},null,null,null,null,0.11382113821138211]
[null,null,"5.6.2.3","Kitchen gloves, cloths etc",null,null,0.1,4,770,7.4,null,null,null,null,{"$error":"#DIV/0!"},null,null,null,null,0.1565040650406504]
[null,null,"5.6.2.4","Pins, needles, tape measures, nails, nuts and bolts etc",null,null,0.2,4,340,9.4,null,null,null,null,{"$error":"#DIV/0!"},null,null,null,null,6.910569105691057E-2]
[null,null,null,null,null,null,null,null,null,null,null,null,null,null,{"$error":"#DIV/0!"},null,null,null,null,0]
[null,"5.6.3","Domestic services, carpet cleaning, hire/repair of furniture/furnishings",null,null,null,2.2999999999999998,63,740,8.8000000000000007,null,null,{"$f":"G318","v":2.2999999999999998},null,{"$error":"#DIV/0!"},null,null,null,null,0.15040650406504066]
[null,null,"5.6.3.1","Domestic services, including cleaners, gardeners, au pairs",null,null,1.8,50,380,10.7,null,null,null,null,{"$error":"#DIV/0!"},null,null,null,null,7.7235772357723581E-2]
[null,null,"5.6.3.2","Carpet cleaning, ironing service, window cleaner",null,null,0.5,13,460,7.3,null,null,null,null,{"$error":"#DIV/0!"},null,null,null,null,9.3495934959349589E-2]
[null,null,"5.6.3.3","Hire/repair of household furniture and furnishings",null,null,0,0,"..",74.599999999999994,null,null,null,null,{"$error":"#DIV/0!"},null,null,null,null,{"$error":"#VALUE!"}]
[null,null,null,null,null,null,null,null,null,null,null,null,null,null,{"$error":"#DIV/0!"},null,null,null,null,0]
[null,null,null,null,null,null,null,null,null,null,null,null,null,null,{"$error":"#DIV/0!"},null,null,null,null,0]
[6,"Health",null,null,null,null,7.2,196,2610,8.5,6,{"$f":"B324","v":"Health"},{"$f":"M326+M338","v":0},{"$f":"G324","v":7.2},0,0.7,"Essential","Excludes private dental/ medical costs ",null,0.53048780487804881]
[null,null,null,null,null,null,null,null,null,null,null,null,null,null,{"$error":"#DIV/0!"},null,null,null,null,0]
[6.1,"Medical products, appliances and equipment",null,null,null,null,3.8,103,2470,10.4,null,{"$f":"B326","v":"Medical products, appliances and equipment"},null,null,null,null,"Essential",null,null,0.50203252032520329]
[null,"6.1.1","Medicines, prescriptions and healthcare products",null,null,null,2.2000000000000002,61,2300,14.5,null,null,null,null,{"$error":"#DIV/0!"},null,null,null,null,0.46747967479674796]
[null,null,"6.1.1.1","NHS prescription charges and payments",null,null,0.2,6,170,8.6,null,null,null,null,{"$error":"#DIV/0!"},null,null,null,null,3.4552845528455285E-2]
[null,null,"6.1.1.2","Medicines and medical goods (not NHS)",null,null,1.4,39,2090,5,null,null,null,null,{"$error":"#DIV/0!"},null,null,null,null,0.42479674796747968]
[null,null,"6.1.1.3","Other medical products (eg plasters, condoms, hot water bottle etc)",null,null,0.2,4,310,10.5,null,null,null,null,{"$error":"#DIV/0!"},null,null,null,null,6.3008130081300809E-2]
[null,null,"6.1.1.4","Non-optical appliances and equipment (eg wheelchairs, batteries",null,null,null,null,null,null,null,null,null,null,{"$error":"#DIV/0!"},null,null,null,null,0]
[null,null,null,"for hearing aids, shoe build-up)",null,null,0.5,12,30,68.900000000000006,null,null,null,null,{"$error":"#DIV/0!"},null,null,null,null,6.0975609756097563E-3]
[null,null,null,null,null,null,null,null,null,null,null,null,null,null,{"$error":"#DIV/0!"},null,null,null,null,0]
[null,"6.1.2","Spectacles, lenses, accessories and repairs",null,null,null,1.6,43,380,11.8,null,null,null,null,{"$error":"#DIV/0!"},null,null,null,null,7.7235772357723581E-2]
[null,null,"6.1.2.1","Purchase of spectacles, lenses, prescription sunglasses",null,null,1.5,42,340,12,null,null,null,null,{"$error":"#DIV/0!"},null,null,null,null,6.910569105691057E-2]
[null,null,"6.1.2.2","Accessories/repairs to spectacles/lenses",null,null,0,1,60,18.600000000000001,null,null,null,null,{"$error":"#DIV/0!"},null,null,null,null,1.2195121951219513E-2]
[null,null,null,null,null,null,null,null,null,null,null,null,null,null,{"$error":"#DIV/0!"},null,null,null,null,0]
[6.2,"Hospital services",null,null,null,null,3.4,93,400,13.5,null,{"$f":"B338","v":"Hospital services"},{"$f":"SUBTOTAL(9,M339:M342)","v":0},null,null,null,"Essential","Exclude Private medical, dental , optical",null,{"$f":"I338/$I$11","v":8.1300813008130079E-2}]
[null,"6.2.1","Out patient services",null,null,null,3.4,92,400,13.7,null,null,null,null,{"$error":"#DIV/0!"},null,null,null,null,8.1300813008130079E-2]
[null,null,"6.2.1.1","NHS medical, optical, dental and medical auxiliary services",null,null,0.9,26,190,13,null,null,null,null,{"$error":"#DIV/0!"},null,null,null,null,3.8617886178861791E-2]
[null,null,"6.2.1.2","Private medical, optical, dental and medical auxiliary services",null,null,2.4,66,230,18.3,null,null,{"$f":"G341","v":2.4},null,{"$error":"#DIV/0!"},null,null,null,null,4.6747967479674794E-2]
[null,null,"6.2.1.3","Other services",null,null,0,0,"..",91.2,null,null,null,null,{"$error":"#DIV/0!"},null,null,null,null,{"$error":"#VALUE!"}]
[null,null,null,null,null,null,null,null,null,null,null,null,null,null,{"$error":"#DIV/0!"},null,null,null,null,0]
[null,"6.2.2","In-patient hospital services",null,null,null,0,1,"..",80.3,null,null,null,null,{"$error":"#DIV/0!"},null,null,null,null,{"$error":"#VALUE!"}]
[null,null,null,null,null,null,null,null,null,null,null,null,null,null,{"$error":"#DIV/0!"},null,null,null,null,0]
[null,null,null,null,null,null,null,null,null,null,null,null,null,null,{"$error":"#DIV/0!"},null,null,null,null,0]
["Note: The commodity and service categories are not comparable with those in publications before 2001-02.",null,null,null,null,null,null,null,null,null,null,null,null,null,{"$error":"#DIV/0!"},null,null,null,null,0]
["The numbering is sequential, it does not use actual COICOP codes.",null,null,null,null,null,null,null,null,null,null,null,null,null,{"$error":"#DIV/0!"},null,null,null,null,0]
["Please see background notes for symbols and conventions used in this report.",null,null,null,null,null,null,null,null,null,null,null,null,null,{"$error":"#DIV/0!"},null,null,null,null,0]
[null,null,null,null,null,null,null,null,null,null,null,null,null,null,{"$error":"#DIV/0!"},null,null,null,null,0]
[null,null,null,null,null,null,null,null,null,null,null,null,null,null,{"$error":"#DIV/0!"},null,null,null,null,0]
[null,null,null,null,null,null,null,null,null,null,null,null,null,null,{"$error":"#DIV/0!"},null,null,null,null,0]
[null,null,null,null,null,null,null,null,null,null,null,null,null,null,{"$error":"#DIV/0!"},null,null,null,null,0]
["Table A1",null,null,null,null,null,null,null,null,null,null,null,null,null,{"$error":"#DIV/0!"},null,null,null,null,0]
["Components of household expenditure (cont)",null,null,null,null,null,null,null,null,null,null,null,null,null,{"$error":"#DIV/0!"},null,null,null,null,0]
["UK, financial year ending 2016",null,null,null,null,null,null,null,null,null,null,null,null,null,{"$error":"#DIV/0!"},null,null,null,null,0]
[null,null,null,null,null,null,null,null,null,null,null,null,null,null,{"$error":"#DIV/0!"},null,null,null,null,0]
[null,null,null,null,null,null,null,null,null,null,null,null,null,null,{"$error":"#DIV/0!"},null,null,null,null,0]
[null,null,null,null,null,null,"Average weekly","Total","Recording","Percentage",null,null,null,null,{"$error":"#DIV/0!"},null,null,null,null,{"$error":"#VALUE!"}]
[null,null,null,null,null,null,"expenditure","weekly","house-","standard ",null,null,null,null,{"$error":"#DIV/0!"},null,null,null,null,{"$error":"#VALUE!"}]
[null,null,null,null,null,null,"all house-","expenditure","holds","error (full",null,null,null,null,{"$error":"#DIV/0!"},null,null,null,null,{"$error":"#VALUE!"}]
[null,null,null,null,null,null,"holds (£)","(£ million)","in sample","method)",null,null,null,null,{"$error":"#DIV/0!"},null,null,null,null,{"$error":"#VALUE!"}]
[null,null,null,null,null,null,null,null,null,null,null,null,null,null,{"$error":"#DIV/0!"},null,null,null,null,0]
[null,null,null,null,null,null,null,null,null,null,null,null,null,null,{"$error":"#DIV/0!"},null,null,null,null,0]
["Commodity or service",null,null,null,null," ",null,null,null,null,null,null,null,null,{"$error":"#DIV/0!"},null,null,null,null,0]
[null,null,null,null,null,null,null,null,null,null,null,null,null,null,{"$f":"M366/N366","v":{"$error":"#DIV/0!"}},null,null,null,null,0]
[7,"Transport",null,null,null,null,72.7,1980,4340,2,7,{"$f":"B367","v":"Transport"},{"$f":"M369+M383+M406","v":12.4},{"$f":"G367","v":72.7},0.17056396148555708,0.65,"Essential & Basic ","It is anticipated the ONS captures both essential and non essential plus some duplication ie car running costs plus public transport costs and both may not apply, suggest the 65% is potentially essential or basic standard of living expense and could be reduced further if not a car owner to say 35%",null,0.88211382113821135]
[null,null,null,null,null,null,null,null,null,null,null,null,null,null,{"$error":"#DIV/0!"},null,null,null,null,0]
[7.1,"Purchase of vehicles",null,null,null,null,24.8,676,1250,4.3,null,{"$f":"B369","v":"Purchase of vehicles"},{"$f":"G369/2","v":12.4},null,null,null,"Basic","Exclude 50% as either purchase of new or used rather than combined so suggest that 50% is considered to be a basic standard of living expense",null,0.25406504065040653]
[null,"7.1.1","Purchase of new cars and vans",null,null,null,8.6999999999999993,236,360,8.1,null,null,null,null,{"$error":"#DIV/0!"},null,null,null,null,7.3170731707317069E-2]
[null,null,"7.1.1.1","Outright purchases",null,null,4.0999999999999996,112,80,12.9,null,null,null,null,{"$error":"#DIV/0!"},null,null,null,null,1.6260162601626018E-2]
[null,null,"7.1.1.2","Loan/Hire Purchase of new car/van",null,null,4.5,124,270,10.5,null,null,null,null,{"$error":"#DIV/0!"},null,null,null,null,5.4878048780487805E-2]
[null,null,null,null,null,null,null,null,null,null,null,null,null,null,{"$error":"#DIV/0!"},null,null,null,null,0]
[null,"7.1.2","Purchase of second hand cars or vans",null,null,null,14.9,405,900,5,null,null,null,null,{"$error":"#DIV/0!"},null,null,null,null,0.18292682926829268]
[null,null,"7.1.2.1","Outright purchases",null,null,10.5,286,520,5.8,null,null,null,null,{"$error":"#DIV/0!"},null,null,null,null,0.10569105691056911]
[null,null,"7.1.2.2","Loan/Hire Purchase of second hand car/van",null,null,4.4000000000000004,119,410,8.6,null,null,null,null,{"$error":"#DIV/0!"},null,null,null,null,8.3333333333333329E-2]
[null,null,null,null,null,null,null,null,null,null,null,null,null,null,{"$error":"#DIV/0!"},null,null,null,null,0]
[null,"7.1.3","Purchase of motorcycles",null,null,null,1.3,35,80,20.6,null,null,null,null,{"$error":"#DIV/0!"},null,null,null,null,1.6260162601626018E-2]
[null,null,"7.1.3.1","Outright purchases of new or second hand motorcycles",null,null,0.3,9,20,28.1,null,null,null,null,{"$error":"#DIV/0!"},null,null,null,null,4.0650406504065045E-3]
[null,null,"7.1.3.2","Loan/Hire Purchase of new or second hand motorcycles",null,null,0.1,3,10,46.8,null,null,null,null,{"$error":"#DIV/0!"},null,null,null,null,2.0325203252032522E-3]
[null,null,"7.1.3.3","Purchase of bicycles and other vehicles",null,null,0.8,23,40,28.2,null,null,null,null,{"$error":"#DIV/0!"},null,null,null,null,8.130081300813009E-3]
[null,null,null,null,null,null,null,null,null,null,null,null,null,null,{"$error":"#DIV/0!"},null,null,null,null,0]
[7.2,"Operation of personal transport",null,null,null,null,30.8,837,3780,2.2000000000000002,null,{"$f":"B383","v":"Operation of personal transport"},{"$f":"SUBTOTAL(9,M384:M404)","v":0},null,null,null,"Basic","Exclude elements of operational costs such as accessoroes, motoring organisations subscriptions, garage rent and driving lessons as not considered to be essential",null,0.76829268292682928]
[null,"7.2.1","Spares and accessories",null,null,null,2.5,68,360,15.2,null,null,{"$f":"G384/2","v":1.25},null,{"$error":"#DIV/0!"},null,null,"only 50% required for basic standard of living - new cars may have element of parts / servicing included in a warrantly",null,7.3170731707317069E-2]
[null,null,"7.2.1.1","Car/van accessories and fittings",null,null,0.2,6,70,30.8,null,null,null,null,{"$error":"#DIV/0!"},null,null,null,null,1.4227642276422764E-2]
[null,null,"7.2.1.2","Car/van spare parts",null,null,2,55,220,18.100000000000001,null,null,null,null,{"$error":"#DIV/0!"},null,null,null,null,4.4715447154471545E-2]
[null,null,"7.2.1.3","Motorcycle accessories and spare parts",null,null,0.1,2,10,38.200000000000003,null,null,null,null,{"$error":"#DIV/0!"},null,null,null,null,2.0325203252032522E-3]
[null,null,"7.2.1.4","Bicycle accessories, repairs and other costs",null,null,0.2,6,90,17.600000000000001,null,null,null,null,{"$error":"#DIV/0!"},null,null,null,null,1.8292682926829267E-2]
[null,null,null,null,null,null,null,null,null,null,null,null,null,null,{"$error":"#DIV/0!"},null,null,null,null,0]
[null,"7.2.2","Petrol, diesel and other motor oils",null,null,null,19.399999999999999,527,3070,1.9,null,null,null,null,{"$error":"#DIV/0!"},null,null,null,null,0.62398373983739841]
[null,null,"7.2.2.1","Petrol",null,null,12,327,2200,2.6,null,null,null,null,{"$error":"#DIV/0!"},null,null,null,null,0.44715447154471544]
[null,null,"7.2.2.2","Diesel oil",null,null,7.3,197,1290,3.2,null,null,null,null,{"$error":"#DIV/0!"},null,null,null,null,0.26219512195121952]
[null,null,"7.2.2.3","Other motor oils",null,null,0.1,3,70,15,null,null,null,null,{"$error":"#DIV/0!"},null,null,null,null,1.4227642276422764E-2]
[null,null,null,null,null,null,null,null,null,null,null,null,null,null,{"$error":"#DIV/0!"},null,null,null,null,0]
[null,"7.2.3","Repairs and servicing",null,null,null,6.2,169,2560,3.6,null,null,null,null,{"$error":"#DIV/0!"},null,null,null,null,0.52032520325203258]
[null,null,"7.2.3.1","Car or van repairs, servicing and other work",null,null,6.1,167,2550,3.6,null,null,null,null,{"$error":"#DIV/0!"},null,null,null,null,0.51829268292682928]
[null,null,"7.2.3.2","Motorcycle repairs and servicing",null,null,0.1,2,40,27.1,null,null,null,null,{"$error":"#DIV/0!"},null,null,null,null,8.130081300813009E-3]
[null,null,null,null,null,null,null,null,null,null,null,null,null,null,{"$error":"#DIV/0!"},null,null,null,null,0]
[null,"7.2.4","Other motoring costs",null,null,null,2.7,73,1870,5.9,null,null,null,null,{"$error":"#DIV/0!"},null,null,null,null,0.38008130081300812]
[null,null,"7.2.4.1","Motoring organisation subscription (eg AA and RAC)",null,null,0.4,12,770,7.1,null,null,{"$f":"G400","v":0.4},null,{"$error":"#DIV/0!"},null,null,"non essential",null,0.1565040650406504]
[null,null,"7.2.4.2","Garage rent, other costs (excluding fines), car washing etc",null,null,0.9,25,330,11.8,null,null,{"$f":"G401","v":0.9},null,{"$error":"#DIV/0!"},null,null,"non essential",null,6.7073170731707321E-2]
[null,null,"7.2.4.3","Parking fees, tolls, and permits (excluding motoring fines)",null,null,0.8,22,1030,6.2,null,null,null,null,{"$error":"#DIV/0!"},null,null,null,null,{"$f":"I402/$I$11","v":0.20934959349593496}]
[null,null,"7.2.4.4","Driving lessons",null,null,0.4,12,60,20.2,null,null,{"$f":"G403","v":0.4},null,{"$error":"#DIV/0!"},null,null,"non essential",null,1.2195121951219513E-2]
[null,null,"7.2.4.5","Anti-freeze, battery water, cleaning materials",null,null,0.1,3,210,12.5,null,null,null,null,{"$error":"#DIV/0!"},null,null,null,null,4.2682926829268296E-2]
[null,null,null,null,null,null,null,null,null,null,null,null,null,null,{"$error":"#DIV/0!"},null,null,null,null,0]
[7.3,"Transport services",null,null,null,null,17.2,467,2230,3.5,null,{"$f":"B406","v":"Transport services"},{"$f":"SUBTOTAL(9,M407:M427)","v":0},null,null,null,"Essential","Excludes non essential travel costs such as Air Fares, Taxis, Car hire, water travel ",null,0.4532520325203252]
[null,"7.3.1","Rail and tube fares",null,null,null,4.0999999999999996,112,760,6,null,null,null,null,{"$error":"#DIV/0!"},null,null,null,null,0.15447154471544716]
[null,null,"7.3.1.1","Season tickets",null,null,1.8,50,230,10.4,null,null,null,null,{"$error":"#DIV/0!"},null,null,null,null,4.6747967479674794E-2]
[null,null,"7.3.1.2","Other than season tickets",null,null,2.2999999999999998,62,600,6.1,null,null,null,null,{"$error":"#DIV/0!"},null,null,null,null,0.12195121951219512]
[null,null,null,null,null,null,null,null,null,null,null,null,null,null,{"$error":"#DIV/0!"},null,null,null,null,0]
[null,"7.3.2","Bus and coach fares",null,null,null,1.3,37,720,6.4,null,null,null,null,{"$error":"#DIV/0!"},null,null,null,null,0.14634146341463414]
[null,null,"7.3.2.1","Season tickets",null,null,0.6,16,170,10.9,null,null,null,null,{"$error":"#DIV/0!"},null,null,null,null,3.4552845528455285E-2]
[null,null,"7.3.2.2","Other than season tickets",null,null,0.7,20,600,6.5,null,null,null,null,{"$error":"#DIV/0!"},null,null,null,null,0.12195121951219512]
[null,null,null,null,null,null,null,null,null,null,null,null,null,null,{"$error":"#DIV/0!"},null,null,null,null,0]
[null,"7.3.3","Combined fares",null,null,null,0.7,19,90,15.6,null,null,null,null,{"$error":"#DIV/0!"},null,null,null,null,1.8292682926829267E-2]
[null,null,"7.3.3.1","Combined fares other than season tickets",null,null,0.1,3,30,28.7,null,null,null,null,{"$error":"#DIV/0!"},null,null,null,null,6.0975609756097563E-3]
[null,null,"7.3.3.2","Combined fares season tickets",null,null,0.6,16,60,18.899999999999999,null,null,null,null,{"$error":"#DIV/0!"},null,null,null,null,1.2195121951219513E-2]
[null,null,null,null,null,null,null,null,null,null,null,null,null,null,{"$error":"#DIV/0!"},null,null,null,null,0]
[null,"7.3.4","Other travel and transport",null,null,null,11,300,1480,3.7,null,null,{"$f":"G419-G422","v":10.9},null,{"$error":"#DIV/0!"},null,"Excluded ","generally Excluded (aside from School travel) as considered non essential ",null,0.30081300813008133]
[null,null,"7.3.4.1","Air fares (within UK)",null,null,0.3,8,90,21,null,null,null,null,{"$error":"#DIV/0!"},null,null,null,null,1.8292682926829267E-2]
[null,null,"7.3.4.2","Air fares (international)",null,null,6.2,169,520,5,null,null,null,null,{"$error":"#DIV/0!"},null,null,null,null,0.10569105691056911]
[null,null,"7.3.4.3","School travel",null,null,0.1,2,20,69.900000000000006,null,null,null,null,{"$error":"#DIV/0!"},null,null,null,null,4.0650406504065045E-3]
[null,null,"7.3.4.4","Taxis and hired cars with drivers",null,null,1.1000000000000001,30,530,6.3,null,null,null,null,{"$error":"#DIV/0!"},null,null,null,null,0.10772357723577236]
[null,null,"7.3.4.5","Other personal travel and transport services",null,null,0.3,7,300,17.3,null,null,null,null,{"$error":"#DIV/0!"},null,null,null,null,6.097560975609756E-2]
[null,null,"7.3.4.6","Hire of self-drive cars, vans, bicycles",null,null,0.2,5,30,24.9,null,null,null,null,{"$error":"#DIV/0!"},null,null,null,null,6.0975609756097563E-3]
[null,null,"7.3.4.7","Car leasing",null,null,2.6,70,240,7.2,null,null,null,null,{"$error":"#DIV/0!"},null,null,null,null,4.878048780487805E-2]
[null,null,"7.3.4.8","Water travel, ferries and season tickets",null,null,0.3,8,50,29.4,null,null,null,null,{"$error":"#DIV/0!"},null,null,null,null,1.016260162601626E-2]
[null,null,null,null,null,null,null,null,null,null,null,null,null,null,{"$error":"#DIV/0!"},null,null,null,null,0]
[null,null,null,null,null,null,null,null,null,null,null,null,null,null,{"$error":"#DIV/0!"},null,null,null,null,0]
["Note: The commodity and service categories are not comparable with those in publications before 2001-02.",null,null,null,null,null,null,null,null,null,null,null,null,null,{"$f":"M430/N430","v":{"$error":"#DIV/0!"}},null,null,null,null,0]
["The numbering is sequential, it does not use actual COICOP codes.",null,null,null,null,null,null,null,null,null,null,null,null,null,{"$error":"#DIV/0!"},null,null,null,null,0]
["Please see background notes for symbols and conventions used in this report.",null,null,null,null,null,null,null,null,null,null,null,null,null,{"$error":"#DIV/0!"},null,null,null,null,0]
[null,null,null,null,null,null,null,null,null,null,null,null,null,null,{"$error":"#DIV/0!"},null,null,null,null,0]
[null,null,null,null,null,null,null,null,null,null,null,null,null,null,{"$error":"#DIV/0!"},null,null,null,null,0]
[null,null,null,null,null,null,null,null,null,null,null,null,null,null,{"$error":"#DIV/0!"},null,null,null,null,0]
[null,null,null,null,null,null,null,null,null,null,null,null,null,null,{"$error":"#DIV/0!"},null,null,null,null,0]
[null,null,null,null,null,null,null,null,null,null,null,null,null,null,{"$error":"#DIV/0!"},null,null,null,null,0]
[null,null,null,null,null,null,null,null,null,null,null,null,null,null,{"$error":"#DIV/0!"},null,null,null,null,0]
["Table A1",null,null,null,null,null,null,null,null,null,null,null,null,null,{"$error":"#DIV/0!"},null,null,null,null,0]
["Components of household expenditure (cont)",null,null,null,null,null,null,null,null,null,null,null,null,null,{"$error":"#DIV/0!"},null,null,null,null,0]
["UK, financial year ending 2016",null,null,null,null,null,null,null,null,null,null,null,null,null,{"$error":"#DIV/0!"},null,null,null,null,0]
[null,null,null,null,null,null,null,null,null,null,null,null,null,null,{"$error":"#DIV/0!"},null,null,null,null,0]
[null,null,null,null,null,null,null,null,null,null,null,null,null,null,{"$error":"#DIV/0!"},null,null,null,null,0]
[null,null,null,null,null,null,"Average weekly","Total","Recording","Percentage",null,null,null,null,{"$error":"#DIV/0!"},null,null,null,null,{"$error":"#VALUE!"}]
[null,null,null,null,null,null,"expenditure","weekly","house-","standard ",null,null,null,null,{"$error":"#DIV/0!"},null,null,null,null,{"$error":"#VALUE!"}]
[null,null,null,null,null,null,"all house-","expenditure","holds","error (full",null,null,null,null,{"$error":"#DIV/0!"},null,null,null,null,{"$error":"#VALUE!"}]
[null,null,null,null,null,null,"holds (£)","(£ million)","in sample","method)",null,null,null,null,{"$error":"#DIV/0!"},null,null,null,null,{"$error":"#VALUE!"}]
[null,null,null,null,null,null,null,null,null,null,null,null,null,null,{"$error":"#DIV/0!"},null,null,null,null,0]
[null,null,null,null,null,null,null,null,null,null,null,null,null,null,{"$error":"#DIV/0!"},null,null,null,null,0]
["Commodity or service",null,null,null,null," ",null,null,null,null,null,null,null,null,{"$error":"#DIV/0!"},null,null,null,null,0]
[null,null,null,null,null,null,null,null,null,null,null,null,null,null,{"$error":"#DIV/0!"},null,null,null,null,0]
[8,"Communication",null,null,null,null,16,435,4750,1.2,8,{"$f":"B452","v":"Communication"},{"$f":"M454+M456+M461+M467","v":0.7},{"$f":"G452","v":16},4.3749999999999997E-2,0.95,"Essential",null,null,0.96544715447154472]
[null,null,null,null,null,null,null,null,null,null,null,null,null,null,{"$error":"#DIV/0!"},null,null,null,null,0]
[8.1,"Postal services",null,null,null,null,0.6,15,720,6.3,null,{"$f":"B454","v":"Postal services"},null,null,null,null,"Essential",null,null,0.14634146341463414]
[null,null,null,null,null,null,null,null,null,null,null,null,null,null,{"$error":"#DIV/0!"},null,null,null,null,0]
[8.1999999999999993,"Telephone and telefax equipment",null,null,null,null,0.7,20,200,15.7,null,{"$f":"B456","v":"Telephone and telefax equipment"},{"$f":"G456","v":0.7},null,null,null,"Essential","Exclude new phone purchase as not considered to be essential",null,4.065040650406504E-2]
[null,"8.2.1","Telephone purchase",null,null,null,0,1,20,29.9,null,null,null,null,{"$error":"#DIV/0!"},null,null,null,null,4.0650406504065045E-3]
[null,"8.2.2","Mobile phone purchase",null,null,null,0.7,19,190,16.3,null,null,null,null,{"$error":"#DIV/0!"},null,null,null,null,3.8617886178861791E-2]
[null,"8.2.3","Answering machine, fax machine, modem purchase",null,null,null,"-","-","-","-",null,null,null,null,{"$error":"#DIV/0!"},null,null,null,null,{"$error":"#VALUE!"}]
[null,null,null,null,null,null,null,null,null,null,null,null,null,null,{"$error":"#DIV/0!"},null,null,null,null,0]
[8.3000000000000007,"Telephone and telefax services",null,null,null,null,11.6,315,4690,1,null,{"$f":"B461","v":"Telephone and telefax services"},null,null,null,null,"Essential",null,null,0.9532520325203252]
[null,"8.3.1","Telephone account",null,null,null,4.0999999999999996,112,4250,1,null,null,null,null,{"$error":"#DIV/0!"},null,null,null,null,0.86382113821138207]
[null,"8.3.2","Telephone coin and other payments",null,null,null,0,0,"..",45.8,null,null,null,null,{"$error":"#DIV/0!"},null,null,null,null,{"$error":"#VALUE!"}]
[null,"8.3.3","Mobile phone account",null,null,null,7,190,3390,1.5,null,null,null,null,{"$error":"#DIV/0!"},null,null,null,null,0.68902439024390238]
[null,"8.3.4","Mobile phone - other payments",null,null,null,0.5,12,290,7,null,null,null,null,{"$error":"#DIV/0!"},null,null,null,null,5.894308943089431E-2]
[null,null,null,null,null,null,null,null,null,null,null,null,null,null,{"$error":"#DIV/0!"},null,null,null,null,{"$f":"I466/$I$11","v":0}]
[8.4,"Internet subscription fees",null,null,null,null,3.1,85,3950,1.3,null,{"$f":"B467","v":"Internet subscription fees"},null,null,null,null,"Essential",null,null,0.80284552845528456]
[null,null,null,null,null,null,null,null,null,null,null,null,null,null,{"$error":"#DIV/0!"},null,null,null,null,0]
[null,null,null,null,null,null,null,null,null,null,null,null,null,null,{"$error":"#DIV/0!"},null,null,null,null,0]
[9,"Recreation and culture",null,null,null,null,68,1851,4850,2.2000000000000002,9,{"$f":"B470","v":"Recreation and culture"},{"$f":"M472+M493+M503+M543+M578+M585","v":41.75},{"$f":"G470","v":68},0.61397058823529416,0.3,"Basic ","TV subscriptions considered to be basic standard of living plus potential additional 20% to captured within surplus income for basic living costs",null,0.98577235772357719]
[null,null,null,null,null,null,null,null,null,null,null,null,null,null,null,null,null,null,null,0]
[9.1,"Audio-visual, photographic and information processing equipment",null,null,null,null,6.1,167,1080,10.6,null,{"$f":"B472","v":"Audio-visual, photographic and information processing equipment"},{"$f":"G472","v":6.1},null,null,null,"Excluded","Purchase of new equipment not  considered essential",null,0.21951219512195122]
[null,"9.1.1","Audio equipment and accessories, CD players",null,null,null,1,27,400,12.7,null,null,null,null,null,null,null,null,null,8.1300813008130079E-2]
[null,null,"9.1.1.1","Audio equipment, CD players including in car",null,null,0.2,7,40,20.2,null,null,null,null,null,null,null,null,null,8.130081300813009E-3]
[null,null,"9.1.1.2","Audio accessories eg tapes, headphones etc",null,null,0.7,20,360,15.6,null,null,null,null,null,null,null,null,null,7.3170731707317069E-2]
[null,null,null,null,null,null,null,null,null,null,null,null,null,null,null,null,null,null,null,0]
[null,"9.1.2","TV, video and computers",null,null,null,4.5,121,780,11.8,null,null,null,null,null,null,null,null,null,0.15853658536585366]
[null,null,"9.1.2.1","Purchase of TV and digital decoder",null,null,1.5,42,70,26.3,null,null,null,null,null,null,null,null,null,1.4227642276422764E-2]
[null,null,"9.1.2.2","Satellite dish purchase and installation",null,null,0.1,3,"..",46.7,null,null,null,null,null,null,null,null,null,{"$error":"#VALUE!"}]
[null,null,"9.1.2.3","Cable TV connection",null,null,"-","-","-","-",null,null,null,null,null,null,null,null,null,{"$error":"#VALUE!"}]
[null,null,"9.1.2.4","Video recorder",null,null,"-","-","-","-",null,null,null,null,null,null,null,null,null,{"$error":"#VALUE!"}]
[null,null,"9.1.2.5","DVD player/recorder",null,null,0.1,1,"..",42.2,null,null,null,null,null,null,null,null,null,{"$error":"#VALUE!"}]
[null,null,"9.1.2.6","Blank, pre-recorded video cassettes, DVDs",null,null,0.5,15,410,7.3,null,null,null,null,null,null,null,null,null,8.3333333333333329E-2]
[null,null,"9.1.2.7","Personal computers, printers and calculators",null,null,1.9,53,310,15.7,null,null,null,null,null,null,null,null,null,6.3008130081300809E-2]
[null,null,"9.1.2.8","Spare parts for TV, video, audio",null,null,0.1,4,60,34.799999999999997,null,null,null,null,null,null,null,null,null,1.2195121951219513E-2]
[null,null,"9.1.2.9","Repair of audio-visual, photographic and information processing",null,null,0.1,3,30,29.1,null,null,null,null,null,null,null,null,null,6.0975609756097563E-3]
[null,null,null,null,null,null,null,null,null,null,null,null,null,null,null,null,null,null,null,0]
[null,"9.1.3","Photographic, cine and optical equipment",null,null,null,0.7,19,60,53.3,null,null,null,null,null,null,null,null,null,1.2195121951219513E-2]
[null,null,"9.1.3.1","Photographic and cine equipment",null,null,0.3,7,50,32,null,null,null,null,null,null,null,null,null,1.016260162601626E-2]
[null,null,"9.1.3.2","Camera films",null,null,0,0,"..",69.2,null,null,null,null,null,null,null,null,null,{"$error":"#VALUE!"}]
[null,null,"9.1.3.3","Optical instruments, binoculars, telescopes, microscopes",null,null,0.4,12,"..",84.4,null,null,null,null,null,null,null,null,null,{"$error":"#VALUE!"}]
[null,null,null,null,null,null,null,null,null,null,null,null,null,null,null,null,null,null,null,0]
[9.1999999999999993,"Other major durables for recreation and culture",null,null,null,null,2.2999999999999998,62,110,19.399999999999999,null,{"$f":"B493","v":"Other major durables for recreation and culture"},{"$f":"G493","v":2.2999999999999998},null,null,null,"Excluded","Boats, trailers, horses not consirered essential",null,2.2357723577235773E-2]
[null,"9.2.1","Purchase of boats, trailers and horses",null,null,null,0.2,4,"..",69.599999999999994,null,null,null,null,null,null,null,null,null,{"$error":"#VALUE!"}]
[null,"9.2.2","Purchase of caravans, mobile homes (including decoration)",null,null,null,1.2,31,30,30.6,null,null,null,null,null,null,null,null,null,6.0975609756097563E-3]
[null,"9.2.3","Accessories for boats, horses, caravans and motor caravans",null,null,null,0.1,1,"..",39.6,null,null,null,null,null,null,null,null,null,{"$error":"#VALUE!"}]
[null,"9.2.4","Musical instruments (purchase and hire)",null,null,null,0.3,8,30,60.2,null,null,null,null,null,null,null,null,null,6.0975609756097563E-3]
[null,"9.2.5","Major durables for indoor recreation ",null,null,null,0,0,"..",99,null,null,null,null,null,null,null,null,null,{"$error":"#VALUE!"}]
[null,"9.2.6","Maintenance and repair of other major durables",null,null,null,0.3,9,40,26.1,null,null,null,null,null,null,null,null,null,8.130081300813009E-3]
[null,"9.2.7","Purchase of motor caravan (new and second-hand) - outright purchase",null,null,null,0.3,8,"..",50.6,null,null,null,null,null,null,null,null,null,{"$error":"#VALUE!"}]
[null,"9.2.8","Purchase of motor caravan (new and second-hand) - loan/HP",null,null,null,"-","-","-","-",null,null,null,null,null,null,null,null,null,{"$error":"#VALUE!"}]
[null,null,null,null,null,null,null,null,null,null,null,null,null,null,null,null,null,null,null,0]
[9.3000000000000007,"Other recreational items and equipment, gardens and pets",null,null,null,null,11.9,323,3310,3.2,null,{"$f":"B503","v":"Other recreational items and equipment, gardens and pets"},{"$f":"G503*50%","v":5.95},null,null,null,"Basic","consider 50% for basic standard of living",null,0.67276422764227639]
[null,"9.3.1","Games, toys and hobbies",null,null,null,2.7,73,1270,6.2,null,null,null,null,null,null,null,null,null,0.258130081300813]
[null,"9.3.2","Computer software and games",null,null,null,0.8,23,190,11.9,null,null,null,null,null,null,null,null,null,3.8617886178861791E-2]
[null,null,"9.3.2.1","Computer software and game cartridges",null,null,0.6,15,170,10.199999999999999,null,null,null,null,null,null,null,null,null,3.4552845528455285E-2]
[null,null,"9.3.2.2","Computer games consoles",null,null,0.3,7,30,27.4,null,null,null,null,null,null,null,null,null,6.0975609756097563E-3]
[null,"9.3.3","Equipment for sport, camping and open-air recreation",null,null,null,1.2,32,380,14,null,null,null,null,null,null,null,null,null,7.7235772357723581E-2]
[null,null,null,null,null,null,null,null,null,null,null,null,null,null,null,null,null,null,null,0]
[null,"9.3.4","Horticultural goods, garden equipment and plants etc",null,null,null,2.6,70,1710,3.8,null,null,null,null,null,null,null,null,null,0.34756097560975607]
[null,null,"9.3.4.1","BBQ and swings",null,null,0.1,3,30,29,null,null,null,null,null,null,null,null,null,6.0975609756097563E-3]
[null,null,"9.3.4.2","Plants, flowers, seeds, fertilisers, insecticides",null,null,2.2999999999999998,63,1640,3.9,null,null,null,null,null,null,null,null,null,0.33333333333333331]
[null,null,"9.3.4.3","Garden decorative",null,null,0.1,3,90,17.5,null,null,null,null,null,null,null,null,null,1.8292682926829267E-2]
[null,null,"9.3.4.4","Artificial flowers, pot pourri",null,null,0,1,40,25.2,null,null,null,null,null,null,null,null,null,8.130081300813009E-3]
[null,null,null,null,null,null,null,null,null,null,null,null,null,null,null,null,null,null,null,0]
[null,"9.3.5","Pets and pet food",null,null,null,4.5999999999999996,125,1880,4.4000000000000004,null,null,null,null,null,null,null,null,null,0.38211382113821141]
[null,null,"9.3.5.1","Pet food",null,null,2.5,67,1760,3.8,null,null,null,null,null,null,null,null,null,0.35772357723577236]
[null,null,"9.3.5.2","Pet purchase and accessories",null,null,0.9,25,620,11,null,null,null,null,null,null,null,null,null,0.12601626016260162]
[null,null,"9.3.5.3","Veterinary and other services for pets identified separately",null,null,1.2,32,190,9.8000000000000007,null,null,null,null,null,null,null,null,null,3.8617886178861791E-2]
[null,null,null,null,null,null,null,null,null,null,null,null,null,null,null,null,null,null,null,0]
[null,null,null,null,null,null,null,null,null,null,null,null,null,null,null,null,null,null,null,0]
["Note: The commodity and service categories are not comparable with those in publications before 2001-02.",null,null,null,null,null,null,null,null,null,null,null,null,null,null,null,null,null,null,0]
["The numbering is sequential, it does not use actual COICOP codes.",null,null,null,null,null,null,null,null,null,null,null,null,null,null,null,null,null,null,0]
["Please see background notes for symbols and conventions used in this report.",null,null,null,null,null,null,null,null,null,null,null,null,null,null,null,null,null,null,0]
[null,null,null,null,null,null,null,null,null,null,null,null,null,null,null,null,null,null,null,0]
[null,null,null,null,null,null,null,null,null,null,null,null,null,null,null,null,null,null,null,0]
[null,null,null,null,null,null,null,null,null,null,null,null,null,null,null,null,null,null,null,0]
["Table A1",null,null,null,null,null,null,null,null,null,null,null,null,null,null,null,null,null,null,0]
["Components of household expenditure (cont)",null,null,null,null,null,null,null,null,null,null,null,null,null,null,null,null,null,null,0]
["UK, financial year ending 2016",null,null,null,null,null,null,null,null,null,null,null,null,null,null,null,null,null,null,{"$f":"I530/$I$11","v":0}]
[null,null,null,null,null,null,null,null,null,null,null,null,null,null,null,null,null,null,null,0]
[null,null,null,null,null,null,null,null,null,null,null,null,null,null,null,null,null,null,null,0]
[null,null,null,null,null,null,"Average weekly","Total","Recording","Percentage",null,null,null,null,null,null,null,null,null,{"$error":"#VALUE!"}]
[null,null,null,null,null,null,"expenditure","weekly","house-","standard ",null,null,null,null,null,null,null,null,null,{"$error":"#VALUE!"}]
[null,null,null,null,null,null,"all house-","expenditure","holds","error (full",null,null,null,null,null,null,null,null,null,{"$error":"#VALUE!"}]
[null,null,null,null,null,null,"holds (£)","(£ million)","in sample","method)",null,null,null,null,null,null,null,null,null,{"$error":"#VALUE!"}]
[null,null,null,null,null,null,null,null,null,null,null,null,null,null,null,null,null,null,null,0]
[null,null,null,null,null,null,null,null,null,null,null,null,null,null,null,null,null,null,null,0]
["Commodity or service",null,null,null,null," ",null,null,null,null,null,null,null,null,null,null,null,null,null,0]
[null,null,null,null,null,null,null,null,null,null,null,null,null,null,null,null,null,null,null,0]
[9,"Recreation and culture (continued)",null,null,null,null,null,null,null,null,null,null,null,null,null,null,null,null,null,0]
[null,null,null,null,null,null,null,null,null,null,null,null,null,null,null,null,null,null,null,0]
[9.4,"Recreational and cultural services",null,null,null,null,20.2,551,4640,2.2000000000000002,null,{"$f":"B543","v":"Recreational and cultural services"},{"$f":"SUBTOTAL(9,M544:M576)","v":0},null,null,null,"Basic","Excluded elements of Sports Subscriptions, cinema, theater admission but include TV, video, satellite rental, cable subscriptions and TV licences considered to be a basic standard of living",null,0.94308943089430897]
[null,"9.4.1","Sports admissions, subscriptions, leisure class fees and equipment hire",null,null,null,6.7,182,1860,4.3,null,null,{"$f":"G544*50%","v":3.35},null,null,null,null,"consider 50% for basic standard of living",null,0.37804878048780488]
[null,null,"9.4.1.1","Spectator sports: admission charges",null,null,0.8,21,140,16.2,null,null,null,null,null,null,null,null,null,2.8455284552845527E-2]
[null,null,"9.4.1.2","Participant sports (excluding subscriptions)",null,null,1,28,640,6.5,null,null,null,null,null,null,null,null,null,0.13008130081300814]
[null,null,"9.4.1.3","Subscriptions to sports and social clubs",null,null,2.4,65,890,8,null,null,null,null,null,null,null,null,null,0.18089430894308944]
[null,null,"9.4.1.4","Leisure class fees",null,null,2.4,66,830,6.3,null,null,null,null,null,null,null,null,null,0.16869918699186992]
[null,null,"9.4.1.5","Hire of equipment for sport and open air recreation",null,null,0.1,2,40,27.8,null,null,null,null,null,null,null,null,null,8.130081300813009E-3]
[null,null,null,null,null,null,null,null,null,null,null,null,null,null,null,null,null,null,null,0]
[null,"9.4.2","Cinema, theatre and museums etc",null,null,null,2.6,70,810,6.3,null,null,{"$f":"G551*50%","v":1.3},null,null,null,null,"consider 50% for basic standard of living",null,0.16463414634146342]
[null,null,"9.4.2.1","Cinemas",null,null,0.7,20,430,6,null,null,null,null,null,null,null,null,null,8.7398373983739841E-2]
[null,null,"9.4.2.2","Live entertainment: theatre, concerts, shows",null,null,1.1000000000000001,31,240,10.199999999999999,null,null,null,null,null,null,null,null,null,4.878048780487805E-2]
[null,null,"9.4.2.3","Museums, zoological gardens, theme parks, houses and gardens",null,null,0.7,18,240,12.5,null,null,null,null,null,null,null,null,null,4.878048780487805E-2]
[null,null,null,null,null,null,null,null,null,null,null,null,null,null,null,null,null,null,null,0]
[null,"9.4.3","TV, video, satellite rental, cable subscriptions and TV licences",null,null,null,6.8,185,4360,1.4,null,null,null,null,null,null,null,null,null,0.88617886178861793]
[null,null,"9.4.3.1","TV licences",null,null,2.2999999999999998,61,4070,0.5,null,null,null,null,null,null,null,null,null,0.82723577235772361]
[null,null,"9.4.3.2","Satellite subscriptions",null,null,3.4,92,1990,2.5,null,null,null,null,null,null,null,null,null,0.40447154471544716]
[null,null,"9.4.3.3","Rent for TV/Satellite/VCR",null,null,0,0,10,32.4,null,null,null,null,null,null,null,null,null,2.0325203252032522E-3]
[null,null,"9.4.3.4","Cable subscriptions",null,null,1,28,710,5.0999999999999996,null,null,null,null,null,null,null,null,null,0.1443089430894309]
[null,null,"9.4.3.5","TV slot meter payments",null,null,0,0,"..",61.4,null,null,null,null,null,null,null,null,null,{"$error":"#VALUE!"}]
[null,null,"9.4.3.6","Video, cassette and CD hire",null,null,0.1,3,230,10.5,null,null,null,null,null,null,null,null,null,4.6747967479674794E-2]
[null,null,null,null,null,null,null,null,null,null,null,null,null,null,null,null,null,null,null,0]
[null,"9.4.4","Miscellaneous entertainments",null,null,null,1.4,39,1040,8.8000000000000007,null,null,{"$f":"G564","v":1.4},null,null,null,null,null,null,0.21138211382113822]
[null,null,"9.4.4.1","Admissions to clubs, dances, discos, bingo",null,null,0.6,17,380,10.8,null,null,null,null,null,null,null,null,null,7.7235772357723581E-2]
[null,null,"9.4.4.2","Social events and gatherings",null,null,0.3,8,160,30.9,null,null,null,null,null,null,null,null,null,3.2520325203252036E-2]
[null,null,"9.4.4.3","Subscriptions for leisure activities and other subscriptions",null,null,0.5,14,650,9.5,null,null,null,null,null,null,null,null,null,0.13211382113821138]
[null,null,null,null,null,null,null,null,null,null,null,null,null,null,null,null,null,null,null,0]
[null,"9.4.5","Development of film, deposit for film development, passport",null,null,null,null,null,null,null,null,null,null,null,null,null,null,null,null,0]
[null,null,"photos, holiday and school photos",null,null,null,0.2,6,130,14.9,null,null,{"$f":"G570*50%","v":0.1},null,null,null,null,"consider 50% for basic standard of living",null,2.6422764227642278E-2]
[null,null,null,null,null,null,null,null,null,null,null,null,null,null,null,null,null,null,null,0]
[null,"9.4.6","Gambling payments",null,null,null,2.6,70,1760,4.4000000000000004,null,null,{"$f":"G572","v":2.6},null,null,null,null,null,null,0.35772357723577236]
[null,null,"9.4.6.1","Football pools stakes",null,null,0,0,20,33.9,null,null,null,null,null,null,null,null,null,4.0650406504065045E-3]
[null,null,"9.4.6.2","Bingo stakes excluding admission",null,null,0.2,6,90,19.2,null,null,null,null,null,null,null,null,null,1.8292682926829267E-2]
[null,null,"9.4.6.3","Lottery ",null,null,1.8,48,1540,3.7,null,null,null,null,null,null,null,null,null,0.31300813008130079]
[null,null,"9.4.6.4","Bookmaker, tote, other betting stakes",null,null,0.6,16,400,13,null,null,null,null,null,null,null,null,null,8.1300813008130079E-2]
[null,null,null,null,null,null,null,null,null,null,null,null,null,null,null,null,null,null,null,0]
[9.5,"Newspapers, books and stationery",null,null,null,null,5.3,145,3770,2.6,null,{"$f":"B578","v":"Newspapers, books and stationery"},{"$f":"G578","v":5.3},null,null,null,"Excluded","Non Essential",null,0.76626016260162599]
[null,"9.5.1","Books",null,null,null,1.2,32,940,6.3,null,null,null,null,null,null,null,null,null,0.1910569105691057]
[null,"9.5.2","Stationery, diaries, address books, art materials",null,null,null,0.8,22,1210,4.9000000000000004,null,null,null,null,null,null,null,null,null,0.2459349593495935]
[null,"9.5.3","Cards, calendars, posters and other printed matter",null,null,null,1.2,32,2100,4.4000000000000004,null,null,null,null,null,null,null,null,null,0.42682926829268292]
[null,"9.5.4","Newspapers",null,null,null,1.5,40,1930,3.9,null,null,null,null,null,null,null,null,null,0.39227642276422764]
[null,"9.5.5","Magazines and periodicals",null,null,null,0.7,19,1510,4.4000000000000004,null,null,null,null,null,null,null,null,null,0.30691056910569103]
[null,null,null,null,null,null,null,null,null,null,null,null,null,null,null,null,null,null,null,0]
[9.6,"Package holidays",null,null,null,null,22.1,603,970,4.4000000000000004,null,{"$f":"B585","v":"Package holidays"},{"$f":"G585","v":22.1},null,null,null,"Excluded","Non Essential",null,0.19715447154471544]
[null,"9.6.1","Package holidays - UK",null,null,null,1.4,38,180,10.5,null,null,null,null,null,null,null,null,null,3.6585365853658534E-2]
[null,"9.6.2","Package holidays - abroad",null,null,null,20.8,565,830,4.5999999999999996,null,null,null,null,null,null,null,null,null,0.16869918699186992]
[null,null,null,null,null,null,null,null,null,null,null,null,null,null,null,null,null,null,null,0]
[null,null,null,null,null,null,null,null,null,null,null,null,null,null,null,null,null,null,null,0]
[10,"Education",null,null,null,null,7,192,270,14.1,10,{"$f":"B590","v":"Education"},"suggest 50%",{"$f":"G590","v":7},0.5,0.5,"Basic ","Not all these would apply - although there would be an element which would be payable so recommend 50%",null,5.4878048780487805E-2]
[null,null,null,null,null,null,null,null,null,null,null,null,null,null,null,null,null,null,null,0]
[10.1,"Education fees",null,null,null,null,6.7,181,170,14.8,null,{"$f":"B592","v":"Education fees"},null,null,null,null,null,null,null,3.4552845528455285E-2]
[null,"10.1.1","Nursery and primary education",null,null,null,0.8,23,20,30.8,null,null,null,null,null,null,null,null,null,4.0650406504065045E-3]
[null,"10.1.2","Secondary education",null,null,null,1.5,40,20,33.6,null,null,null,null,null,null,null,null,null,{"$f":"I594/$I$11","v":4.0650406504065045E-3}]
[null,"10.1.3","Sixth form college/college education",null,null,null,0.4,12,40,35.6,null,null,null,null,null,null,null,null,null,8.130081300813009E-3]
[null,"10.1.4","University education",null,null,null,3.6,98,70,19,null,null,null,null,null,null,null,null,null,1.4227642276422764E-2]
[null,"10.1.5","Other education",null,null,null,0.3,9,40,27.8,null,null,null,null,null,null,null,null,null,8.130081300813009E-3]
[null,null,null,null,null,null,null,null,null,null,null,null,null,null,null,null,null,null,null,0]
[10.199999999999999,"Payments for school trips, other ad-hoc expenditure",null,null,null,null,0.4,10,100,17.7,null,{"$f":"B599","v":"Payments for school trips, other ad-hoc expenditure"},null,null,null,null,null,null,null,2.032520325203252E-2]
[null,"10.2.1","Nursery and primary education",null,null,null,0.1,3,60,21.3,null,null,null,null,null,null,null,null,null,1.2195121951219513E-2]
[null,"10.2.2","Secondary education",null,null,null,0.1,4,40,21.6,null,null,null,null,null,null,null,null,null,8.130081300813009E-3]
[null,"10.2.3","Sixth form college/college education",null,null,null,0,1,"..",69.3,null,null,null,null,null,null,null,null,null,{"$error":"#VALUE!"}]
[null,"10.2.4","University education",null,null,null,0.1,3,"..",58.7,null,null,null,null,null,null,null,null,null,{"$error":"#VALUE!"}]
[null,"10.2.5","Other education",null,null,null,0,0,"..",54.4,null,null,null,null,null,null,null,null,null,{"$error":"#VALUE!"}]
[null,null,null,null,null,null,null,null,null,null,null,null,null,null,null,null,null,null,null,0]
[null,null,null,null,null,null,null,null,null,null,null,null,null,null,null,null,null,null,null,0]
["Note: The commodity and service categories are not comparable with those in publications before 2001-02.",null,null,null,null,null,null,null,null,null,null,null,null,null,null,null,null,null,null,0]
["The numbering is sequential, it does not use actual COICOP codes.",null,null,null,null,null,null,null,null,null,null,null,null,null,null,null,null,null,null,0]
["Please see background notes for symbols and conventions used in this report.",null,null,null,null,null,null,null,null,null,null,null,null,null,null,null,null,null,null,0]
[null,null,null,null,null,null,null,null,null,null,null,null,null,null,null,null,null,null,null,0]
[null,null,null,null,null,null,null,null,null,null,null,null,null,null,null,null,null,null,null,0]
[null,null,null,null,null,null,null,null,null,null,null,null,null,null,null,null,null,null,null,0]
[null,null,null,null,null,null,null,null,null,null,null,null,null,null,null,null,null,null,null,0]
["Table A1",null,null,null,null,null,null,null,null,null,null,null,null,null,null,null,null,null,null,0]
["Components of household expenditure (cont)",null,null,null,null,null,null,null,null,null,null,null,null,null,null,null,null,null,null,0]
["UK, financial year ending 2016",null,null,null,null,null,null,null,null,null,null,null,null,null,null,null,null,null,null,0]
[null,null,null,null,null,null,null,null,null,null,null,null,null,null,null,null,null,null,null,0]
[null,null,null,null,null,null,null,null,null,null,null,null,null,null,null,null,null,null,null,0]
[null,null,null,null,null,null,"Average weekly","Total","Recording","Percentage",null,null,null,null,null,null,null,null,null,{"$error":"#VALUE!"}]
[null,null,null,null,null,null,"expenditure","weekly","house-","standard ",null,null,null,null,null,null,null,null,null,{"$error":"#VALUE!"}]
[null,null,null,null,null,null,"all house-","expenditure","holds","error (full",null,null,null,null,null,null,null,null,null,{"$error":"#VALUE!"}]
[null,null,null,null,null,null,"holds (£)","(£ million)","in sample","method)",null,null,null,null,null,null,null,null,null,{"$error":"#VALUE!"}]
[null,null,null,null,null,null,null,null,null,null,null,null,null,null,null,null,null,null,null,0]
[null,null,null,null,null,null,null,null,null,null,null,null,null,null,null,null,null,null,null,0]
["Commodity or service",null,null,null,null," ",null,null,null,null,null,null,null,null,null,null,null,null,null,0]
[null,null,null,null,null,null,null,null,null,null,null,null,null,null,null,null,null,null,null,0]
[11,"Restaurants and hotels",null,null,null,null,45.1,1229,4340,2.2999999999999998,11,{"$f":"B627","v":"Restaurants and hotels"},{"$f":"M629+M646","v":8.9},{"$f":"G627","v":45.1},{"$f":"M627/N627","v":0.19733924611973391},0.2,"Basic ","consider some to be a basic standard of living, eg 50% of takeaway spend, other snack food and confectionery and school meals or meals bought and eaten at the office",null,0.88211382113821135]
[null,null,null,null,null,null,null,null,null,null,null,null,null,null,{"$error":"#DIV/0!"},null,null,null,null,0]
[11.1,"Catering services",null,null,null,null,36.200000000000003,986,4270,2,null,{"$f":"B629","v":"Catering services"},{"$f":"SUBTOTAL(9,M630:M644)","v":0},null,null,null,"Basic","consider some to be a basic standard of living, eg 50% of takeaway spend, other snack food and confectionery and school meals or meals bought and eaten at the office",null,0.86788617886178865]
[null,"11.1.1","Restaurant and café meals",null,null,null,17.3,471,3500,2.2999999999999998,null,null,{"$f":"G630","v":17.3},null,{"$error":"#DIV/0!"},null,null,null,null,0.71138211382113825]
[null,"11.1.2","Alcoholic drinks (away from home)",null,null,null,7.5,203,2040,3.4,null,null,{"$f":"G631","v":7.5},null,{"$error":"#DIV/0!"},null,null,null,null,0.41463414634146339]
[null,"11.1.3","Take away meals eaten at home",null,null,null,4.7,127,2120,2.5,null,null,{"$f":"G632/2","v":2.35},null,{"$error":"#DIV/0!"},null,null,"Takeaway - Basic standard of Living but maybe at 50% frequency",null,0.43089430894308944]
[null,null,null,null,null,null,null,null,null,null,null,null,null,null,{"$error":"#DIV/0!"},null,null,null,null,0]
[null,"11.1.4","Other take-away and snack food",null,null,null,4.4000000000000004,119,2700,2.4,null,null,null,null,{"$error":"#DIV/0!"},null,null,"could be considered basic standard of living ",null,0.54878048780487809]
[null,null,"11.1.4.1","Hot and cold food",null,null,3.2,88,2340,2.7,null,null,null,null,{"$error":"#DIV/0!"},null,null,null,null,0.47560975609756095]
[null,null,"11.1.4.2","Confectionery",null,null,0.3,8,1080,4,null,null,null,null,{"$error":"#DIV/0!"},null,null,null,null,0.21951219512195122]
[null,null,"11.1.4.3","Ice cream",null,null,0.1,4,400,6.7,null,null,null,null,{"$error":"#DIV/0!"},null,null,null,null,8.1300813008130079E-2]
[null,null,"11.1.4.4","Soft drinks",null,null,0.8,21,1710,3.1,null,null,null,null,{"$error":"#DIV/0!"},null,null,null,null,0.34756097560975607]
[null,null,null,null,null,null,null,null,null,null,null,null,null,null,{"$error":"#DIV/0!"},null,null,null,null,0]
[null,"11.1.5","Contract catering (food)",null,null,null,0.7,18,20,44.5,null,null,{"$f":"G640","v":0.7},null,{"$error":"#DIV/0!"},null,null,null,null,4.0650406504065045E-3]
[null,null,null,null,null,null,null,null,null,null,null,null,null,null,{"$error":"#DIV/0!"},null,null,null,null,0]
[null,"11.1.6","Canteens",null,null,null,1.7,48,1110,4.5,null,null,null,null,{"$error":"#DIV/0!"},null,null,"School/ work meals - Basic standard of Living",null,0.22560975609756098]
[null,null,"11.1.6.1","School meals",null,null,0.7,18,390,7.8,null,null,null,null,{"$error":"#DIV/0!"},null,null,null,null,7.926829268292683E-2]
[null,null,"11.1.6.2","Meals bought and eaten at the workplace",null,null,1.1000000000000001,29,860,5.2,null,null,null,null,{"$error":"#DIV/0!"},null,null,null,null,0.17479674796747968]
[null,null,null,null,null,null,null,null,null,null,null,null,null,null,{"$error":"#DIV/0!"},null,null,null,null,0]
[11.2,"Accommodation services",null,null,null,null,8.9,243,1410,6,null,{"$f":"B646","v":"Accommodation services"},{"$f":"G646","v":8.9},null,null,null,"Excluded","Non - essential holidays / room hire",null,0.28658536585365851]
[null,"11.2.1","Holiday in the UK",null,null,null,5.0999999999999996,138,1160,4.4000000000000004,null,null,null,null,{"$error":"#DIV/0!"},null,null,null,null,0.23577235772357724]
[null,"11.2.2","Holiday abroad",null,null,null,3.6,99,350,12,null,null,null,null,{"$error":"#DIV/0!"},null,null,null,null,7.113821138211382E-2]
[null,"11.2.3","Room hire",null,null,null,0.2,6,20,50,null,null,null,null,{"$error":"#DIV/0!"},null,null,null,null,4.0650406504065045E-3]
[null,null,null,null,null,null,null,null,null,null,null,null,null,null,{"$error":"#DIV/0!"},null,null,null,null,0]
[null,null,null,null,null,null,null,null,null,null,null,null,null,null,{"$error":"#DIV/0!"},null,null,null,null,0]
[12,"Miscellaneous goods and services",null,null,null,null,39.700000000000003,1080,4810,2.2999999999999998,12,{"$f":"B652","v":"Miscellaneous goods and services"},{"$f":"M654+M670+M678+M718+M732","v":14.5},{"$f":"G652","v":39.700000000000003},0.36523929471032746,0.5,"Buildings Ins- Essential, Toilerires and Soap Essential, remainder - Basic ","of which 15% toiletries / 43% vehicle ins / 21% home insurances/ 21% other",null,0.97764227642276424]
[null,null,null,null,null,null,null,null,null,null,null,null,null,null,null,null,null,null,null,0]
[12.1,"Personal care",null,null,null,null,11.4,311,4230,2.2999999999999998,null,{"$f":"B654","v":"Personal care"},{"$f":"SUBTOTAL(9,M655:M668)","v":0},null,null,null,"Essential & Basic ","Excluding 50% of Hairdressing/ Beauty treatments, hair products and cosmetics and all electrical appliances",null,0.8597560975609756]
[null,"12.1.1","Hairdressing, beauty treatment",null,null,null,3.7,101,1160,4.0999999999999996,null,null,{"$f":"G655*50%","v":1.85},null,null,null,"Basic ","Have included 50% as beauty treatment not considered essential",null,0.23577235772357724]
[null,"12.1.2","Toilet paper",null,null,null,0.8,22,2020,2.6,null,null,null,null,null,null,null,{"$f":"6.2/20","v":0.31},null,0.41056910569105692]
[null,null,null,null,null,null,null,null,null,null,null,null,null,null,null,null,null,null,null,0]
[null,"12.1.3","Toiletries and soap",null,null,null,2.2999999999999998,64,3400,2.2999999999999998,null,null,null,null,null,null,null,null,null,{"$f":"I658/$I$11","v":0.69105691056910568}]
[null,null,"12.1.3.1","Toiletries (disposable including tampons, lipsyl, toothpaste etc)",null,null,1.4,39,2880,2.6,null,null,null,null,null,null,null,null,null,0.58536585365853655]
[null,null,"12.1.3.2","Bar of soap, liquid soap, shower gel etc",null,null,0.5,12,1570,3.8,null,null,null,null,null,null,null,null,null,0.31910569105691056]
[null,null,"12.1.3.3","Toilet requisites (durable including razors, hairbrushes, toothbrushes etc)",null,null,0.5,12,1050,4.9000000000000004,null,null,null,null,null,null,null,null,null,0.21341463414634146]
[null,null,null,null,null,null,null,null,null,null,null,null,null,null,null,null,null,null,null,0]
[null,"12.1.4","Baby toiletries and accessories (disposable)",null,null,null,0.7,19,900,4.5,null,null,null,null,null,null,null,null,null,0.18292682926829268]
[null,null,null,null,null,null,null,null,null,null,null,null,null,null,null,null,null,null,null,0]
[null,"12.1.5","Hair products, cosmetics and electrical appliances for personal care",null,null,null,3.9,105,2590,3.5,null,null,{"$f":"SUBTOTAL(9,M666:M668)","v":0},null,null,null,null,null,null,0.52642276422764223]
[null,null,"12.1.5.1","Hair products",null,null,0.8,23,1480,4.0999999999999996,null,null,{"$f":"G666*50%","v":0.4},null,null,null,null,null,null,0.30081300813008133]
[null,null,"12.1.5.2","Cosmetics and related accessories",null,null,2.7,74,1930,4.2,null,null,{"$f":"G667*50%","v":1.35},null,null,null,null,null,null,0.39227642276422764]
[null,null,"12.1.5.3","Electrical appliances for personal care, including hairdryers, shavers etc",null,null,0.3,7,90,15.2,null,null,{"$f":"G668","v":0.3},null,null,null,null,null,null,1.8292682926829267E-2]
[null,null,null,null,null,null,null,null,null,null,null,null,null,null,null,null,null,null,null,0]
[12.2,"Personal effects ",null,null,null,null,3.4,93,1130,8.6999999999999993,null,{"$f":"B670","v":"Personal effects "},{"$f":"G670","v":3.4},null,null,null,"Excluded","Non Essential",null,0.22967479674796748]
[null,"12.2.1","Jewellery, clocks and watches and other personal effects",null,null,null,1.9,52,760,13.4,null,null,null,null,null,null,null,null,null,0.15447154471544716]
[null,"12.2.2","Leather and travel goods (excluding baby items)",null,null,null,0.9,24,390,8.4,null,null,null,null,null,null,null,null,null,7.926829268292683E-2]
[null,"12.2.3","Sunglasses (non-prescription)",null,null,null,0.1,3,80,22.1,null,null,null,null,null,null,null,null,null,1.6260162601626018E-2]
[null,"12.2.4","Baby equipment (excluding prams and pushchairs)",null,null,null,0.3,7,50,25.6,null,null,null,null,null,null,null,null,null,1.016260162601626E-2]
[null,"12.2.5","Prams, pram accessories and pushchairs",null,null,null,0.2,4,20,42.2,null,null,null,null,null,null,null,null,null,4.0650406504065045E-3]
[null,"12.2.6","Repairs to personal goods",null,null,null,0.1,2,30,26.7,null,null,null,null,null,null,null,null,null,6.0975609756097563E-3]
[null,null,null,null,null,null,null,null,null,null,null,null,null,null,null,null,null,null,null,0]
[12.3,"Social protection",null,null,null,null,4.4000000000000004,119,260,9.6,null,{"$f":"B678","v":"Social protection"},{"$f":"G678","v":4.4000000000000004},null,null,null,"Excluded","Childcare captured seperately, home help would expect to be covered in Other expenditure",null,5.2845528455284556E-2]
[null,"12.3.1","Residential homes",null,null,null,0,1,"..",56.8,null,null,null,null,null,null,null,null,null,{"$error":"#VALUE!"}]
[null,"12.3.2","Home help",null,null,null,0.4,11,20,25.8,null,null,null,null,null,null,null,null,null,4.0650406504065045E-3]
[null,"12.3.3","Nursery, crèche, playschools",null,null,null,1.3,36,70,17.399999999999999,null,null,null,null,null,null,null,null,null,1.4227642276422764E-2]
[null,"12.3.4","Child care payments",null,null,null,2.6,72,180,12.1,null,null,null,null,null,null,null,null,null,3.6585365853658534E-2]
[null,null,null,null,null,null,null,null,null,null,null,null,null,null,null,null,null,null,null,0]
[null,null,null,null,null,null,null,null,null,null,null,null,null,null,null,null,null,null,null,0]
["Note: The commodity and service categories are not comparable with those in publications before 2001-02.",null,null,null,null,null,null,null,null,null,null,null,null,null,null,null,null,null,null,0]
["The numbering is sequential, it does not use actual COICOP codes.",null,null,null,null,null,null,null,null,null,null,null,null,null,null,null,null,null,null,0]
["Please see background notes for symbols and conventions used in this report.",null,null,null,null,null,null,null,null,null,null,null,null,null,null,null,null,null,null,0]
[null,null,null,null,null,null,null,null,null,null,null,null,null,null,null,null,null,null,null,0]
[null,null,null,null,null,null,null,null,null,null,null,null,null,null,null,null,null,null,null,0]
[null,null,null,null,null,null,null,null,null,null,null,null,null,null,null,null,null,null,null,0]
[null,null,null,null,null,null,null,null,null,null,null,null,null,null,null,null,null,null,null,0]
[null,null,null,null,null,null,null,null,null,null,null,null,null,null,null,null,null,null,null,0]
[null,null,null,null,null,null,null,null,null,null,null,null,null,null,null,null,null,null,null,0]
[null,null,null,null,null,null,null,null,null,null,null,null,null,null,null,null,null,null,null,0]
[null,null,null,null,null,null,null,null,null,null,null,null,null,null,null,null,null,null,null,0]
[null,null,null,null,null,null,null,null,null,null,null,null,null,null,null,null,null,null,null,0]
[null,null,null,null,null,null,null,null,null,null,null,null,null,null,null,null,null,null,null,0]
[null,null,null,null,null,null,null,null,null,null,null,null,null,null,null,null,null,null,null,0]
[null,null,null,null,null,null,null,null,null,null,null,null,null,null,null,null,null,null,null,0]
[null,null,null,null,null,null,null,null,null,null,null,null,null,null,null,null,null,null,null,0]
[null,null,null,null,null,null,null,null,null,null,null,null,null,null,null,null,null,null,null,0]
["Table A1",null,null,null,null,null,null,null,null,null,null,null,null,null,null,null,null,null,null,0]
["Components of household expenditure (cont)",null,null,null,null,null,null,null,null,null,null,null,null,null,null,null,null,null,null,0]
["UK, financial year ending 2016",null,null,null,null,null,null,null,null,null,null,null,null,null,null,null,null,null,null,0]
[null,null,null,null,null,null,null,null,null,null,null,null,null,null,null,null,null,null,null,0]
[null,null,null,null,null,null,null,null,null,null,null,null,null,null,null,null,null,null,null,0]
[null,null,null,null,null,null,"Average weekly","Total","Recording","Percentage",null,null,null,null,null,null,null,null,null,{"$error":"#VALUE!"}]
[null,null,null,null,null,null,"expenditure","weekly","house-","standard ",null,null,null,null,null,null,null,null,null,{"$error":"#VALUE!"}]
[null,null,null,null,null,null,"all house-","expenditure","holds","error (full",null,null,null,null,null,null,null,null,null,{"$error":"#VALUE!"}]
[null,null,null,null,null,null,"holds (£)","(£ million)","in sample","method)",null,null,null,null,null,null,null,null,null,{"$error":"#VALUE!"}]
[null,null,null,null,null,null,null,null,null,null,null,null,null,null,null,null,null,null,null,0]
[null,null,null,null,null,null,null,null,null,null,null,null,null,null,null,null,null,null,null,0]
["Commodity or service",null,null,null,null," ",null,null,null,null,null,null,null,null,null,null,null,null,null,0]
[null,null,null,null,null,null,null,null,null,null,null,null,null,null,null,null,null,null,null,0]
[null,null,null,null,null,null,null,null,null,null,null,null,null,null,null,null,null,{"$f":"6.2/20","v":0.31},null,0]
[12,"Miscellaneous goods and services (continued)",null,null,null,null,null,null,null,null,null,null,null,null,null,null,null,null,null,0]
[null,null,null,null,null,null,null,null,null,null,null,null,null,null,null,null,null,null,null,0]
[12.4,"Insurance",null,null,null,null,15.6,425,4330,1.9,null,{"$f":"B718","v":"Insurance"},{"$f":"M719+M724+M726+M730","v":1.9000000000000001},null,null,null,null,null,null,0.88008130081300817]
[null,"12.4.1","Household insurances",null,null,null,4.5999999999999996,124,3810,1.9,null,null,{"$f":"SUBTOTAL(9,M720:M722)","v":0},null,null,null,null,null,null,0.77439024390243905]
[null,null,"12.4.1.1","Structure insurance",null,null,2.2999999999999998,63,3150,2.2000000000000002,null,null,null,null,null,null,null,null,null,0.6402439024390244]
[null,null,"12.4.1.2","Contents insurance",null,null,2.2000000000000002,59,3690,1.9,null,null,null,null,null,null,null,null,null,0.75]
[null,null,"12.4.1.3","Insurance for household appliances",null,null,0.1,2,70,20.7,null,null,{"$f":"G722","v":0.1},null,null,null,null,null,null,{"$f":"I722/$I$11","v":1.4227642276422764E-2}]
[null,null,null,null,null,null,null,null,null,null,null,null,null,null,null,null,null,null,null,0]
[null,"12.4.2","Medical insurance premiums",null,null,null,1.6,44,570,6.8,null,null,{"$f":"G724","v":1.6},null,null,null,null,null,null,0.11585365853658537]
[null,null,null,null,null,null,null,null,null,null,null,null,null,null,null,null,null,null,null,0]
[null,"12.4.3","Vehicle insurance including boat insurance",null,null,null,9.1999999999999993,250,3790,2.2000000000000002,null,null,{"$f":"SUBTOTAL(9,M727:M728)","v":0},null,null,null,null,null,null,0.77032520325203258]
[null,null,"12.4.3.1","Vehicle insurance",null,null,9.1,247,3790,2,null,null,null,null,null,null,null,null,null,0.77032520325203258]
[null,null,"12.4.3.2","Boat insurance (not home)",null,null,0.1,4,"..",71.099999999999994,null,null,{"$f":"G728","v":0.1},null,null,null,null,null,null,{"$error":"#VALUE!"}]
[null,null,null,null,null,null,null,null,null,null,null,null,null,null,null,null,null,null,null,0]
[null,"12.4.4","Non-package holiday, other travel insurance",null,null,null,0.3,7,60,31.8,null,null,{"$f":"G730","v":0.3},null,null,null,null,null,null,1.2195121951219513E-2]
[null,null,null,null,null,null,null,null,null,null,null,null,null,null,null,null,null,null,null,0]
[12.5,"Other services",null,null,null,null,4.8,132,1780,11.5,null,{"$f":"B732","v":"Other services"},{"$f":"G732","v":4.8},null,null,null,null,"These are one off costs and would not factor into ongoing affordability",null,0.36178861788617889]
[null,"12.5.1","Moving house",null,null,null,2.9,78,300,8.6999999999999993,null,null,null,null,null,null,null,null,null,6.097560975609756E-2]
[null,null,"12.5.1.1","Moving and storage of furniture",null,null,0.3,8,140,18.2,null,null,null,null,null,null,null,null,null,2.8455284552845527E-2]
[null,null,"12.5.1.2","Property transaction - purchase and sale",null,null,1.4,38,100,13,null,null,null,null,null,null,null,null,null,2.032520325203252E-2]
[null,null,"12.5.1.3","Property transaction - sale only",null,null,0.6,16,40,20.399999999999999,null,null,null,null,null,null,null,null,null,8.130081300813009E-3]
[null,null,"12.5.1.4","Property transaction - purchase only",null,null,0.4,10,60,16.100000000000001,null,null,null,null,null,null,null,null,null,1.2195121951219513E-2]
[null,null,"12.5.1.5","Property transaction - other payments",null,null,0.2,6,80,17.600000000000001,null,null,null,null,null,null,null,null,null,1.6260162601626018E-2]
[null,null,null,null,null,null,null,null,null,null,null,null,null,null,null,null,null,null,null,0]
[null,"12.5.2","Bank, building society, post office, credit card charges",null,null,null,0.6,16,1170,6.9,null,null,null,null,null,null,null,"This would be covered in the commitments section - proven by credit Search",null,0.23780487804878048]
[null,null,"12.5.2.1","Bank and building society charges",null,null,0.5,14,1030,7.6,null,null,null,null,null,null,null,null,null,0.20934959349593496]
[null,null,"12.5.2.2","Bank and Post Office counter charges",null,null,0,0,"..",57.2,null,null,null,null,null,null,null,null,null,{"$error":"#VALUE!"}]
[null,null,"12.5.2.3","Annual standing charge for credit cards",null,null,0.1,2,230,10.8,null,null,null,null,null,null,null,null,null,4.6747967479674794E-2]
[null,null,"12.5.2.4","Commission travellers' cheques and currency",null,null,0,0,"..",108.2,null,null,null,null,null,null,null,null,null,{"$error":"#VALUE!"}]
[null,null,null,null,null,null,null,null,null,null,null,null,null,null,null,null,null,null,null,0]
[null,"12.5.3","Other services and professional fees",null,null,null,1.4,39,640,35.799999999999997,null,null,null,null,null,null,null,null,null,0.13008130081300814]
[null,null,"12.5.3.1","Other professional fees including court fines",null,null,0.2,5,30,30,null,null,null,null,null,null,null,null,null,6.0975609756097563E-3]
[null,null,"12.5.3.2","Legal fees",null,null,0.2,5,10,44.4,null,null,null,null,null,null,null,null,null,2.0325203252032522E-3]
[null,null,"12.5.3.3","Funeral expenses",null,null,0.5,13,"..",93.2,null,null,null,null,null,null,null,null,null,{"$error":"#VALUE!"}]
[null,null,"12.5.3.4","TU and professional organisations",null,null,0.5,14,530,9.5,null,null,null,null,null,null,null,null,null,0.10772357723577236]
[null,null,"12.5.3.5","Other payments for services eg photocopying",null,null,0.1,2,80,23.8,null,null,null,null,null,null,null,null,null,1.6260162601626018E-2]
[null,null,null,null,null,null,null,null,null,null,null,null,null,null,null,null,null,null,null,0]
[null,null,null,null,null,null,null,null,null,null,null,null,null,null,null,null,null,null,null,0]
["1-12","All expenditure groups",null,null,null,null,455.3,12395,4920,1.2,null,null,null,null,null,null,null,null,null,1]
[null,null,null,null,null,null,null,null,null,null,null,null,null,null,null,null,null,null,null,0]
[null,null,null,null,null,null,null,null,null,null,null,null,null,null,null,null,null,null,null,0]
[13,"Other expenditure items",null,null,null,null,73.599999999999994,2002,4730,4,13,{"$f":"B757","v":"Other expenditure items"},{"$f":"G757","v":73.599999999999994},{"$f":"G757","v":73.599999999999994},{"$f":"M757/N757","v":1},0,"Excluded","Council tax would be captured - customers quotation will be used",null,0.96138211382113825]
[null,null,null,null,null,null,null,null,null,null,null,null,null,null,null,null,null,"All other items considered non essential or not applicable",null,0]
[13.1,"Housing: mortgage interest payments, council tax etc",null,null,null,null,47.3,1287,4540,5.4,null,{"$f":"B759","v":"Housing: mortgage interest payments, council tax etc"},null,null,null,null,"Excluded",null,null,0.92276422764227639]
[null,"13.1.1","Mortgage interest payments",null,null,null,19,518,1510,3,null,null,null,null,null,null,null,null,null,0.30691056910569103]
[null,"13.1.2","Mortgage protection premiums",null,null,null,1.2,32,620,6.8,null,null,null,null,null,null,null,null,null,0.12601626016260162]
[null,"13.1.3","Council tax, domestic rates",null,null,null,21,573,4530,0.9,null,null,null,null,null,null,null,null,null,0.92073170731707321]
[null,"13.1.4","Council tax, mortgage (second dwelling)",null,null,null,6.1,165,90,40.200000000000003,null,null,null,null,null,null,null,null,null,1.8292682926829267E-2]
[null,null,null,null,null,null,null,null,null,null,null,null,null,null,null,null,null,null,null,0]
[13.2,"Licences, fines and transfers",null,null,null,null,3.4,92,3640,2.2000000000000002,null,{"$f":"B765","v":"Licences, fines and transfers"},null,null,null,null,"Excluded","Stamp Duty - one off, motoring fines minimal, road tax should be captured in vehicle running costs",null,0.73983739837398377]
[null,"13.2.1","Stamp duty, licences and fines (excluding motoring fines)",null,null,null,0.3,8,70,16.600000000000001,null,null,null,null,null,null,null,null,null,1.4227642276422764E-2]
[null,"13.2.2","Motoring fines",null,null,null,0.1,2,10,39.200000000000003,null,null,null,null,null,null,null,null,null,2.0325203252032522E-3]
[null,"13.2.3","Motor vehicle road taxation payments less refunds",null,null,null,3,82,3630,1.6,null,null,null,null,null,null,null,null,null,0.73780487804878048]
[null,null,null,null,null,null,null,null,null,null,null,null,null,null,null,null,null,null,null,0]
[13.3,"Holiday spending",null,null,null,null,9.9,270,240,13,null,{"$f":"B770","v":"Holiday spending"},null,null,null,null,"Excluded","Non Essential",null,4.878048780487805E-2]
[null,"13.3.1","Money spent abroad",null,null,null,9.9,270,240,13,null,null,null,null,null,null,null,null,null,4.878048780487805E-2]
[null,"13.3.2","Duty free goods bought in UK",null,null,null,0,0,"..",109.4,null,null,null,null,null,null,null,null,null,{"$error":"#VALUE!"}]
[null,null,null,null,null,null,null,null,null,null,null,null,null,null,null,null,null,null,null,0]
[null,null,null,null,null,null,null,null,null,null,null,null,null,null,null,null,null,null,null,0]
["Note: The commodity and service categories are not comparable with those in publications before 2001-02.",null,null,null,null,null,null,null,null,null,null,null,null,null,null,null,null,null,null,0]
["The numbering is sequential, it does not use actual COICOP codes.",null,null,null,null,null,null,null,null,null,null,null,null,null,null,null,null,null,null,0]
["Please see background notes for symbols and conventions used in this report.",null,null,null,null,null,null,null,null,null,null,null,null,null,null,null,null,null,null,0]
[null,null,null,null,null,null,null,null,null,null,null,null,null,null,null,null,null,null,null,0]
[null,null,null,null,null,null,null,null,null,null,null,null,null,null,null,null,null,null,null,0]
[null,null,null,null,null,null,null,null,null,null,null,null,null,null,null,null,null,null,null,0]
[null,null,null,null,null,null,null,null,null,null,null,null,null,null,null,null,null,null,null,0]
[null,null,null,null,null,null,null,null,null,null,null,null,null,null,null,null,null,null,null,0]
[null,null,null,null,null,null,null,null,null,null,null,null,null,null,null,null,null,null,null,0]
[null,null,null,null,null,null,null,null,null,null,null,null,null,null,null,null,null,null,null,0]
[null,null,null,null,null,null,null,null,null,null,null,null,null,null,null,null,null,null,null,0]
[null,null,null,null,null,null,null,null,null,null,null,null,null,null,null,null,null,null,null,{"$f":"I786/$I$11","v":0}]
[null,null,null,null,null,null,null,null,null,null,null,null,null,null,null,null,null,null,null,0]
[null,null,null,null,null,null,null,null,null,null,null,null,null,null,null,null,null,null,null,0]
[null,null,null,null,null,null,null,null,null,null,null,null,null,null,null,null,null,null,null,0]
[null,null,null,null,null,null,null,null,null,null,null,null,null,null,null,null,null,null,null,0]
["Table A1",null,null,null,null,null,null,null,null,null,null,null,null,null,null,null,null,null,null,0]
["Components of household expenditure (cont)",null,null,null,null,null,null,null,null,null,null,null,null,null,null,null,null,null,null,0]
["UK, financial year ending 2016",null,null,null,null,null,null,null,null,null,null,null,null,null,null,null,null,null,null,0]
[null,null,null,null,null,null,null,null,null,null,null,null,null,null,null,null,null,null,null,0]
[null,null,null,null,null,null,null,null,null,null,null,null,null,null,null,null,null,null,null,0]
[null,null,null,null,null,null,"Average weekly","Total","Recording","Percentage",null,null,null,null,null,null,null,null,null,{"$error":"#VALUE!"}]
[null,null,null,null,null,null,"expenditure","weekly","house-","standard ",null,null,null,null,null,null,null,null,null,{"$error":"#VALUE!"}]
[null,null,null,null,null,null,"all house-","expenditure","holds","error (full",null,null,null,null,null,null,null,null,null,{"$error":"#VALUE!"}]
[null,null,null,null,null,null,"holds (£)","(£ million)","in sample","method)",null,null,null,null,null,null,null,null,null,{"$error":"#VALUE!"}]
[null,null,null,null,null,null,null,null,null,null,null,null,null,null,null,null,null,null,null,0]
[null,null,null,null,null,null,null,null,null,null,null,null,null,null,null,null,null,null,null,0]
["Commodity or service",null,null,null,null," ",null,null,null,null,null,null,null,null,null,null,null,null,null,0]
[null,null,null,null,null,null,null,null,null,null,null,null,null,null,null,null,null,null,null,0]
[null,null,null,null,null,null,null,null,null,null,null,null,null,null,null,null,null,null,null,0]
[13,"Other expenditure items (continued)",null,null,null,null,null,null,null,null,null,null,null,null,null,null,null,null,null,0]
[null,null,null,null,null,null,null,null,null,null,null,null,null,null,null,null,null,null,null,0]
[13.4,"Money transfers and credit",null,null,null,null,13,354,2320,6.7,null,{"$f":"B807","v":"Money transfers and credit"},null,null,null,null,"Excluded","Non Essential",null,0.47154471544715448]
[null,"13.4.1","Money, cash gifts given to children",null,null,null,0.1,2,60,23.7,null,null,null,null,null,null,null,null,null,1.2195121951219513E-2]
[null,null,"13.4.1.1","Money given to children for specific purposes",null,null,0.1,2,50,24.5,null,null,null,null,null,null,null,null,null,1.016260162601626E-2]
[null,null,"13.4.1.2","Cash gifts to children (no specific purpose)",null,null,0,0,"..",60.6,null,null,null,null,null,null,null,null,null,{"$error":"#VALUE!"}]
[null,"13.4.2","Cash gifts and donations",null,null,null,11.7,317,2010,7.4,null,null,null,null,null,null,null,null,null,0.40853658536585363]
[null,null,"13.4.2.1","Money/presents given to those outside the household",null,null,4.5,124,740,14.6,null,null,null,null,null,null,null,null,null,0.15040650406504066]
[null,null,"13.4.2.2","Charitable donations and subscriptions",null,null,2.9,80,1360,7.2,null,null,null,null,null,null,null,null,null,0.27642276422764228]
[null,null,"13.4.2.3","Money sent abroad",null,null,2.1,58,210,18.3,null,null,null,null,null,null,null,null,null,4.2682926829268296E-2]
[null,null,"13.4.2.4","Maintenance allowance expenditure",null,null,2,55,160,11.2,null,null,null,null,null,null,null,null,null,3.2520325203252036E-2]
[null,"13.4.3","Club instalment payments (child) and interest on credit cards",null,null,null,1.3,35,530,13.1,null,null,null,null,null,null,null,null,null,0.10772357723577236]
[null,null,"13.4.3.1","Club instalment payment",null,null,"-","-","-","-",null,null,null,null,null,null,null,null,null,{"$error":"#VALUE!"}]
[null,null,"13.4.3.2","Interest on credit cards",null,null,1.3,35,530,13.1,null,null,null,null,null,null,null,null,null,0.10772357723577236]
[null,null,null,null,null,null,null,null,null,null,null,null,null,null,null,null,null,null,null,0]
[null,null,null,null,null,null,null,null,null,null,null,null,null,null,null,null,null,null,null,0]
["Total expenditure",null,null,null,null,null,528.9,14398,4920,1.3,null,null,null,null,null,null,null,null,null,1]
[null,null,null,null,null,null,null,null,null,null,null,null,null,null,null,null,null,null,null,0]
[null,null,null,null,null,null,null,null,null,null,null,null,null,null,null,null,null,null,null,0]
[14,"Other items recorded",null,null,null,null,null,null,null,null,null,{"$f":"B824","v":"Other items recorded"},{"$f":"G826+G831+G833+G843+G847+G857+G862+G863","v":213.4},{"$f":"M824","v":213.4},{"$f":"M824/N824","v":1},0,"Excluded","All not essential/ not applicable or captured automastically in income (ie the Tax / Ni contributions, Pensions etc - these may need to be considered for Self Employed)",null,0]
[null,null,null,null,null,null,null,null,null,null,null,null,null,null,null,null,null,null,null,0]
[14.1,"Life assurance, contributions to pension funds",null,null,null,null,22.5,614,2490,3.8,null,{"$f":"B826","v":"Life assurance, contributions to pension funds"},null,null,null,null,"Excluded","If Essential should be captured in Other category ( e.g Interest Only repayment vehicles) or Essential Insurances",null,0.50609756097560976]
[null,"14.1.1","Life assurance premiums eg mortgage endowment policies",null,null,null,3.3,89,1210,12.6,null,null,null,null,null,null,null,null,null,0.2459349593495935]
[null,"14.1.2","Contributions to pension and superannuation funds etc",null,null,null,15,410,1740,3.6,null,null,null,null,null,null,null,null,null,0.35365853658536583]
[null,"14.1.3","Personal pensions",null,null,null,4.2,115,410,9.8000000000000007,null,null,null,null,null,null,null,null,null,8.3333333333333329E-2]
[null,null,null,null,null,null,null,null,null,null,null,null,null,null,null,null,null,null,null,0]
[14.2,"Other insurance including friendly societies",null,null,null,null,1.6,44,1160,4.0999999999999996,null,{"$f":"B831","v":"Other insurance including friendly societies"},null,null,null,null,"Excluded","Non Essential",null,0.23577235772357724]
[null,null,null,null,null,null,null,null,null,null,null,null,null,null,null,null,null,null,null,0]
[14.3,"Income tax, payments less refunds",null,null,null,null,89.6,2439,3830,2.9,null,{"$f":"B833","v":"Income tax, payments less refunds"},null,null,null,null,"Excluded","As Net monthly Salary is used in calculation these will be excluded",null,0.77845528455284552]
[null,"14.3.1","Income tax paid by employees under PAYE",null,null,null,66.7,1816,2400,3.1,null,null,null,null,null,null,null,null,null,0.48780487804878048]
[null,"14.3.2","Income tax paid direct eg by retired or unoccupied persons",null,null,null,2.7,72,170,21.2,null,null,null,null,null,null,null,null,null,3.4552845528455285E-2]
[null,"14.3.3","Income tax paid direct by self-employed",null,null,null,3.8,104,200,14.4,null,null,null,null,null,null,null,null,null,4.065040650406504E-2]
[null,"14.3.4","Income tax deducted at source from income under covenant from",null,null,null,null,null,null,null,null,null,null,null,null,null,null,null,null,0]
[null,null,"investments or from annuities and pensions",null,null,null,13.2,358,2210,4.4000000000000004,null,null,null,null,null,null,null,null,null,0.44918699186991867]
[null,"14.3.5","Income tax on bonus earnings",null,null,null,4.3,117,760,12.1,null,null,null,null,null,null,null,null,null,0.15447154471544716]
[null,"14.3.6","Income tax refunds under PAYE",null,null,null,0.2,5,30,51.1,null,null,null,null,null,null,null,null,null,6.0975609756097563E-3]
[null,"14.3.7","Income tax refunds other than PAYE",null,null,null,0.8,23,280,13,null,null,null,null,null,null,null,null,null,5.6910569105691054E-2]
[null,null,null,null,null,null,null,null,null,null,null,null,null,null,null,null,null,null,null,0]
[14.4,"National insurance contribution",null,null,null,null,29,789,2470,2,null,{"$f":"B843","v":"National insurance contribution"},null,null,null,null,"Excluded","As Net monthly Salary is used in calculation these will be excluded",null,0.50203252032520329]
[null,"14.4.1","NI contributions paid by employees",null,null,null,28.8,785,2450,2,null,null,null,null,null,null,null,null,null,0.49796747967479676]
[null,"14.4.2","NI contributions paid by non-employees",null,null,null,0.1,4,40,32.5,null,null,null,null,null,null,null,null,null,8.130081300813009E-3]
[null,null,null,null,null,null,null,null,null,null,null,null,null,null,null,null,null,null,null,0]
[14.5,"Purchase or alteration of dwellings (contracted out), mortgages",null,null,null,null,61.1,1664,1930,6.3,null,{"$f":"B847","v":"Purchase or alteration of dwellings (contracted out), mortgages"},null,null,null,null,"Excluded","Mortgage would capture",null,0.39227642276422764]
[null,"14.5.1","Outright purchase of houses, flats etc including deposits",null,null,null,4.8,131,20,41.2,null,null,null,null,null,null,null,null,null,4.0650406504065045E-3]
[null,"14.5.2","Capital repayment of mortgage",null,null,null,23.9,650,1330,3,null,null,null,null,null,null,null,null,null,0.27032520325203252]
[null,"14.5.3","Central heating installation",null,null,null,1.6,43,130,16,null,null,null,null,null,null,null,null,null,{"$f":"I850/$I$11","v":2.6422764227642278E-2}]
[null,"14.5.4","DIY improvements: Double glazing, kitchen units, sheds etc",null,null,null,0.7,18,70,17,null,null,null,null,null,null,null,null,null,1.4227642276422764E-2]
[null,"14.5.5","Home improvements - contracted out",null,null,null,20.8,566,760,9,null,null,null,null,null,null,null,null,null,0.15447154471544716]
[null,"14.5.6","Bathroom fittings",null,null,null,0.5,13,80,43.9,null,null,null,null,null,null,null,null,null,1.6260162601626018E-2]
[null,"14.5.7","Purchase of materials for Capital Improvements",null,null,null,0.2,7,30,31,null,null,null,null,null,null,null,null,null,6.0975609756097563E-3]
[null,"14.5.8","Purchase of second dwelling",null,null,null,8.6,235,60,32.4,null,null,null,null,null,null,null,null,null,1.2195121951219513E-2]
[null,null,null,null,null,null,null,null,null,null,null,null,null,null,null,null,null,null,null,0]
[14.6,"Savings and investments",null,null,null,null,5.8,158,690,7.4,null,{"$f":"B857","v":"Savings and investments"},null,null,null,null,"Excluded","Non -Essential",null,0.1402439024390244]
[null,"14.6.1","Savings, investments (excluding AVCs)",null,null,null,5,137,490,8.4,null,null,null,null,null,null,null,null,null,9.959349593495935E-2]
[null,"14.6.2","Additional Voluntary Contributions",null,null,null,0.6,15,70,16.2,null,null,null,null,null,null,null,null,null,1.4227642276422764E-2]
[null,"14.6.3","Food stamps, other food related expenditure",null,null,null,0.2,6,170,18.100000000000001,null,null,null,null,null,null,null,null,null,3.4552845528455285E-2]
[null,null,null,null,null,null,null,null,null,null,null,null,null,null,null,null,null,null,null,0]
[14.7,"Pay off loan to clear other debt",null,null,null,null,2,54,240,8.3000000000000007,null,{"$f":"B862","v":"Pay off loan to clear other debt"},null,null,null,null,"Excluded","Would be captured in commitments",null,4.878048780487805E-2]
[14.8,"Windfall receipts from gambling etc4",null,null,null,null,1.8,48,430,11.9,null,{"$f":"B863","v":"Windfall receipts from gambling etc4"},null,null,null,null,"Excluded","Non Essential",null,8.7398373983739841E-2]
[]
[]
["Note: The commodity and service categories are not comparable with those in publications before 2001-02."]
["The numbering is sequential, it does not use actual COICOP codes."]
["Please see background notes for symbols and conventions used in this report."]
["4 Expressed as an income figure as opposed to an expenditure figure."]
[]
[]
[]
["Source: Office for National Statistics"]

{"sheet":"Version control","index":18,"n_rows":42,"n_cols":5,"rows_kept":42,"cut":false,"hidden":true,"merged":[]}
["Affordability model - Version control"]
["Version no","Date","Changes","Actioned by","Notes / Authorised by"]
[]
[1,"26042014","Initial model"]
[2,"30062014","Amended for minor formal error in ONS calculation",null,"No risk as not used for underwriting"]
[3,"01082014","Amended to put in 4.5/4 times income caps and also ensures set to 2+ if more than one income",null,"Warning message(s) now shows"]
["2.5","08122015","ONS statistics updated to latest version"]
[null,null,"Model changed to show mortgage required rather than deposit"]
[null,null,"4.5/4 times income caps refined to take account of committed expenditure etc"]
[null,null,"Warning if interest only loan exceeds 60%"]
[null,null,"4th column added for potential joint guarantor"]
["2.6",null,"Mortgage scheme LTV calculation amended following v2.5 amendment"]
[2.7,"2016-12-01","Max term extended to 35 years, VBS mortgage products updated, ONS table updated, over 4 times income warning removed, Income multiple calculated"]
[2.8,"2017-05-01","Revised input sheet to allow notes, prepared by and date for users. Also make income excess etc clearer for underwriters. Updated ONS table (2016)"]
["New Risk Vs0.1 - 0.6","2018-02-01","Introduced field to capture Credit Score for use in future analysis \nIncome -  Removed the Guaranteed O/T/ Bonus income category as not sure that these are ever guaranteed\nCommitted Expenditure - added in category fotr non self financing mortgages/rent \n                                                   - added in a total Credit Card Balance category - (to use the higher of 3% total balances or customer repayment amount)\nRegular Expenditure - combined categories and aligned to ONS data categories, assessment carried out to apportion the amounts considerd to be basic/ essential and the higher of cut declared or ONS is then used in the calculation - with an override available where the customer declared amount is proven to be lower (if this is required).\n-Basic Recreation category removed as this is now captured within the surplus income amount (along with other ad hoc ONS categories which do not fit well elsewhere).\nCalculation now uses the higher of the cust declared or ONS calculated to determine the mortgage amount that we would lend.\n- Updated Income Multiples to align to latest version of 4.5x\n- Updated to SVR +3% stress rate and\n- updated SVR rate to 4.95 in line with latest versuion of calculator in use (V2.11)\n","Sam B"]
["v0.7","2018-04-01","Following walkthrough with Andrew - amended formular corrections and removed calculations no longer in use","Sam B"]
["V0.8","2018-04-01","Added in a calculator to work out the stressed payments for any non self financing mortgages and to calculate the net Basic and Additional incomes.","Sam B"]
["v0.9","2018-04-24","Added in u/w validation worksheets and updated income calculator following walkthrough with Jessica T","Sam B"]
["v0.10","2018-05-04","Updates to u/w sheets and correction of decision ( where loan amount =max allowed the decision was declining - have set so that decision is based on loan amount requested being less than or = to which has corrected the error). Have also removed the cell notes on the override as they get in the way. Also updated table of proofs - no longer need p60 as standard only if basic fluctuates or add income used. Aslo YTD must be greater than 3months worth of salary not at least 3months ","Sam B"]
["v0.11","2018-05-15","Updated decision from Accept, Decline, Refer to Pass, Fail and Marginal Pass (was refer), Added in I/O retirement category which allows for assessment to be made purely on I/O given the repayyment vehicle is sale of property, also removed other category and included I/O costs in other unsecure commitments","Sam B"]
["v0.12","June","Increase amount of non std income used to 50% from current 30%\nAmended split gross income input cell into gross basic and gross additional - to apply the 50% rule to gross\nIncluded an approximation calculation for the split of Net salary into basic and other based on the proportions in gross\nWhere I/O amended the calculation of  documentary evidencing  levels to apply to the i/o affordability \nremoved the 'refer' on i/o calculations which do not pass affordability for C&I\nAmended proof docs for S/E to 2 tax retn and overviews plus 1 year accts - in line with Core Criteria","Sam B","Sent to Andrew Entwisle and Finance to review"]
["v1.0","2018-07-30","Updated to Version 1.0 - as calculations are in line with Core Criteria version 1 . Have increase mortgage term to 40 years and updated the Mort repay tab ( by pulling the formulars down). Updated ONS to the 2017/18 Y/E dat. formatted the data entry headings / formatting inline with feedback to create a broker view and an internal view","Sam B","AE Approved"]
["v1.1","2018-08-17","corrections made to link net additional income to 50% rule from 30% hard coded, updated I/O max loan to cap at 4.49% in line with C&I and amended positioning of customer signature boxes and removed input for 2nd household inorder to encourage 2 separate calculators - replaced UW sheets 2 and 4 with ones replaced from Jess to aid u/w assessment process and data capture. amended refernce to ONS to household composion and added in a no of applicants field, removed max term warning from RIO mortgages","Sam B"]
["v2.0","2018-04-17","Updated to Version 2.0 following approval","Sam B","AE Approved"]
["v2.1","2018-04-21","error found in other (Net) income tab have corrected, and Broker view to have a separate print area so the full calculator prints off, also added in a gross other income field to capture benefits / investment income. ","Sam B"]
["v3.0","2018-04-21","Updated to V3.0 following approval","Sam B","AE Approved"]
["V3.1","2018-09-07","Uodated for SVR change","Andrew E"]
["V3.2","2018-09-10","Correction of calculation formula error resulting from the SVR rate change (caused by mismatch in number formats)\nAlignment of the Adviser and U/W calculator tabs and Version control","Sam B","AJE Approved that the changes to the SVR have been actioned correctly  in the model"]
["V3.3","2018-09-10","Update to the links in the Underwriter assessment tabs","Jessica T"]
["v4.0","2018-09-11","Updated to V4.0 following approval","Sam B"]
["v5.0","2018-11-14","corrected error on cells f-j 22 (Total Gross income calculation) & updated standard wording of customer declaration to include reference to reducing spending if required.- Approved AE","Sam B","AE Approved"]
["v6.0","2018-12-04","Updated the Max LTI from 4.49% to 5% as per agreement at Nov Board (changed on VBS criteria tab - income multiple cap for max loan amount)","Sam B","change in line with  Board approval"]
[6.1,"2018-12-31","Updated the table to include the evidence requirements for Retired applicnts and added a refer decisiojn code for the high LTI cases requiring underwriter approval in line with policy where loan req is >90% of max loan allowed, amended the calculation for Loan requested as % of max loan affordable to exclude the cap from the max loan affordable","Sam B"]
[7,"2019-01-08","updated to V7.0 followoing AE Approval","Sam B","AE Approved"]
[7.1,"2019-04-16","Updated the ONS figures from table A23 to 2018 year end data ","Sam B, KM tested"]
[7.2,"2019-04-17","reduced stress rate from SVR +3% to SVR +2% in line with the Board paper which was agreed at March Board,also removed % from the SVR and Stress rate (along with associated formula) as the mort repay table was not recognising,  and removed autopopulation from the date field.","Sam B, KM Tested"]
[7.3,"2019-04-23","Identified error in formula for mort repay table for any loans over 30 years. - impacted by the removal of % on rates, up to yr30 were hardcoded numbers - have amended back to formular consistent with the 31+ years","Sam B, KM Tested"]
["v8.0","2019-04-24","Testing completed, updated documentatry evidence table on calculator to align to core criteria (to 2 months payslips- previously 3,  for Level 3)  - SB Approved version no. updated and publishing requested","Sam B"]
["V8.1","2019-04-24","removal of the >4.5x LTI on i/o mortgages as no discretion is permitted (outside of Board) and this could potentially be misleading","Sam B, KM Tested"]
["V9.0","2019-04-24","Testing completed, no concerns - SB approved version no. updated and publishing requested","Sam B"]
["V10.0","2019-09-19","Rebranded ready for external brand launch plus added a warning message that the funcionality will be impaired if used on pre- 2010 versions  (following feedback from Broker)","Sam B","Colour / Font changes only no approval necessary"]
[null,null,"Version control now tracked through Creditco updates"]

{"sheet":"Admin","index":19,"n_rows":9,"n_cols":10,"rows_kept":9,"cut":false,"hidden":true,"merged":[]}
["UW","General1","General2","Approval Level","Affordability Level","Approver","Repayment Type","Deposit","Repayment Type","Loan Purpose"]
["Karen","Yes","Yes","Level 1","Level 1","N/A - by Underwriter","Capital & Interest","Equity in property","Capital & Repayment","Purchase"]
["Claire","No","No","Level 2","Level 2","Barrie","Interest-only","Savings","Interest-Only","Like for like Remo"]
["Louise",null,"N/A","Level 3","Level 3","Ian","Part & Part","HTB ISA","Part & Part","Remo + Cap raising"]
["Dan",null,null,"2 x Level 3","Level 4","Steve",null,"Gifted Deposit",null,"Porting"]
["Barrie",null,null,"Creditco",null,"Barrie/Ian",null,"Combination (see notes)",null,"Porting + F/A"]
[null,null,null,null,null,"Barrie/Steve",null,"Other (see notes)",null,"Further Advance"]
[null,null,null,null,null,"Ian/Steve"]
[null,null,null,null,null,"Creditco"]